{"text_format":"1","workbook":"xlsx","n_sheets":4,"sheets":["Instructions","Marks Entry 6-8","Report Card","Abstract 6-8"],"not_rendered":{"charts":1,"images":2,"macros":1,"external_links":1,"defined_names":3,"comments":0,"pivot_tables":0},"unopened":[],"bounds":{"document_bytes":16777216,"sheet_cells":100000,"rows_first":2000,"rows_last":500,"rows_between":2000,"halvings":0,"cell_chars":16384,"cell_head_chars":4096},"cells_cut":0,"cells_raw":0,"read":"whole","date_system":"1900"}

{"sheet":"Instructions","index":0,"n_rows":33,"n_cols":12,"rows_kept":33,"cut":false,"hidden":false,"merged":[[0,0,0,5],[16,1,16,2],[21,1,21,2],[8,1,8,4],[3,1,3,2],[4,1,4,5],[9,1,9,4],[6,1,6,6],[7,1,7,6]]}
["Instructions",null,null,null,null,null,null,null,null,null,"Year","Month"]
["Kindly read All Instructions before Use Report Card Utitly",null,null,null,null,null,null,null,null,null,2022,"Sept"]
[null,null,null,null,null,null,null,null,null,null,2023,"March"]
[1,"First Fill  Necessary Data for report card by click on ",null,"Fill Data",null,null,null,null,null,null,2024]
[2,"In All Sheet Use only or Click on  Yellow coloured Filled  Cell to Enter or Select Data. Rest Cells Are Locked",null,null,null,null,null,null,null,null,2025]
[3,"Now Goto Marks Entry Sheet 6-8 . Then Enter Data ( Marks) in Yellow cell thier",null,null,null,null,null,null,null,null,2026]
[4,"Enter Subjects Total Marks for Each Subject in this sheet at Row no . 20 onwards",null,null,null,null,null,null,null,null,2027]
[5,"You can find Grade Wise , Class Wise , Subject Wise Students count and Topper List",null,null,null,null,null,null,null,null,2028]
[6,"you can copy Paste Students Data Like Name ,Father Name, Class Etc.  From Epunjab Student Report Excel File",null,null,null,null,null,null,null,null,2029]
[7,"After Entered All data in yellow cell of Marks Entry 6-8 Sheet . Goto Report Card to View/Print report card of each Students",null,null,null,null,null,null,null,null,2030]
[]
[]
[]
[]
[]
{"$rows_left_out":19}
{"sheet":"Marks Entry 6-8","index":1,"n_rows":403,"n_cols":53,"rows_kept":403,"cut":false,"hidden":false,"merged":[]}
["Sno",null,"Class","Sec","Student ID","Name","FatherName","MotherName","DOB","Gender","Punjabi","English","Hindi","Maths","Science","social Sci.","Computer Sci",null,{"$f":"Instructions!B31","v":"Drawing"},"Physical Edu.","Total Marks ","Total w/o F",null,"Option","Pbi%","Eng","Hindi","Maths.","Science","social Sci.","Com Sci","Welcome Life","Drawing",{"$f":"T1","v":"Physical Edu."},"Total %","Pass/Fail","Pbi Grade. ","Eng","Hindi","Maths.","Science","SS","Com Sci","WL","Drg","Phy","Grade total","%age dr/ph","Dr/Ph Grade","Dr/phy Total marks",null,null,{"$f":"Table_2[[#This Row],[Column51]]&Table_2[[#This Row],[Column52]]&AW3","v":""}]
[1,null,null,null,null,null,null,null,null,null,null,null,null,null,null,null,null,null,null,null,{"$f":"IF(MIN(Y2:AD2)>=33,SUM(K2:P2),\"--\")","v":"--"},{"$f":"IF(U2=\"--\",0,U2)","v":0},null,null,{"$f":"(K2/Instructions!$C$23)*100","v":0},{"$f":"(L2/Instructions!$C$24)*100","v":0},{"$f":"(M2/Instructions!$C$25)*100","v":0},{"$f":"(N2/Instructions!$C$26)*100","v":0},{"$f":"(O2/Instructions!$C$27)*100","v":0},{"$f":"(P2/Instructions!$C$28)*100","v":0},{"$f":"(Q2/Instructions!$C$29)*100","v":0},{"$f":"(R2/Instructions!$C$30)*100","v":0},{"$f":"(S2/Instructions!$C$31)*100","v":0},{"$f":"(T2/Instructions!$C$30)*100","v":0},{"$f":"(U2/Instructions!$C$33)*100","v":{"$error":"#VALUE!"}},{"$f":"IF(AND(Y2>=33,Z2>=33,AA2>=33,AB2>=33,AC2>=33,AD2>=33),\"PASS\",\"----\")","v":"----"},{"$f":"IFERROR(IF(Y2>90,\"A+\",IF(Y2>80,\"A\",IF(Y2>70,\"B+\",IF(Y2>60,\"B\",IF(Y2>50,\"C+\",IF(Y2>40,\"C\",IF(Y2>=33,\"D\",\"E\"))))))),\"Abs\")","v":"E"},"E","E","E","E","E","E","E","E","E",{"$f":"IFERROR(IF(AI2>90,\"A+\",IF(AI2>80,\"A\",IF(AI2>70,\"B+\",IF(AI2>60,\"B\",IF(AI2>50,\"C+\",IF(AI2>40,\"C\",IF(AI2>=33,\"D\",\"E\"))))))),\"--\")","v":"--"},null,null,null,null,null,{"$f":"Table_2[[#This Row],[Column51]]&Table_2[[#This Row],[Column52]]&AW4","v":""}]
[2,null,null,null,null,null,null,null,null,null,null,null,null,null,null,null,null,null,null,null,{"$f":"IF(MIN(Y3:AD3)>=33,SUM(K3:P3),\"--\")","v":"--"},{"$f":"IF(U3=\"--\",0,U3)","v":0},null,null,{"$f":"(K3/Instructions!$C$23)*100","v":0},{"$f":"(L3/Instructions!$C$24)*100","v":0},{"$f":"(M3/Instructions!$C$25)*100","v":0},{"$f":"(N3/Instructions!$C$26)*100","v":0},{"$f":"(O3/Instructions!$C$27)*100","v":0},{"$f":"(P3/Instructions!$C$28)*100","v":0},{"$f":"(Q3/Instructions!$C$29)*100","v":0},{"$f":"(R3/Instructions!$C$30)*100","v":0},{"$f":"(S3/Instructions!$C$31)*100","v":0},{"$f":"(T3/Instructions!$C$30)*100","v":0},{"$f":"IFERROR((U3/Instructions!$C$33)*100,\"--\")","v":"--"},{"$f":"IF(AND(Y3>=33,Z3>=33,AA3>=33,AB3>=33,AC3>=33,AD3>=33),\"PASS\",\"----\")","v":"----"},"E","E","E","E","E","E","E","E","E","E",{"$f":"IFERROR(IF(AI3>90,\"A+\",IF(AI3>80,\"A\",IF(AI3>70,\"B+\",IF(AI3>60,\"B\",IF(AI3>50,\"C+\",IF(AI3>40,\"C\",IF(AI3>=33,\"D\",\"E\"))))))),\"--\")","v":"A+"},null,null,null,null,null,{"$f":"Table_2[[#This Row],[Column51]]&Table_2[[#This Row],[Column52]]&AW5","v":""}]
[3,null,null,null,null,null,null,null,null,null,null,null,null,null,null,null,null,null,null,null,"--",0,null,null,{"$f":"(K4/Instructions!$C$23)*100","v":0},{"$f":"(L4/Instructions!$C$24)*100","v":0},{"$f":"(M4/Instructions!$C$25)*100","v":0},{"$f":"(N4/Instructions!$C$26)*100","v":0},{"$f":"(O4/Instructions!$C$27)*100","v":0},{"$f":"(P4/Instructions!$C$28)*100","v":0},{"$f":"(Q4/Instructions!$C$29)*100","v":0},{"$f":"(R4/Instructions!$C$30)*100","v":0},{"$f":"(S4/Instructions!$C$31)*100","v":0},{"$f":"(T4/Instructions!$C$30)*100","v":0},{"$f":"(U4/Instructions!$C$33)*100","v":{"$error":"#VALUE!"}},"----","E","E","E","E","E","E","E","E","E","E","--"]
[4,null,null,null,null,null,null,null,null,null,null,null,null,null,null,null,null,null,null,null,"--",0,null,null,{"$f":"(K5/Instructions!$C$23)*100","v":0},{"$f":"(L5/Instructions!$C$24)*100","v":0},{"$f":"(M5/Instructions!$C$25)*100","v":0},{"$f":"(N5/Instructions!$C$26)*100","v":0},{"$f":"(O5/Instructions!$C$27)*100","v":0},{"$f":"(P5/Instructions!$C$28)*100","v":0},{"$f":"(Q5/Instructions!$C$29)*100","v":0},{"$f":"(R5/Instructions!$C$30)*100","v":0},{"$f":"(S5/Instructions!$C$31)*100","v":0},{"$f":"(T5/Instructions!$C$30)*100","v":0},{"$f":"(U5/Instructions!$C$33)*100","v":{"$error":"#VALUE!"}},"----","E","E","E","E","E","E","E","E","E","E","--"]
[5,null,null,null,null,null,null,null,null,null,null,null,null,null,null,null,null,null,null,null,"--",0,null,null,{"$f":"(K6/Instructions!$C$23)*100","v":0},{"$f":"(L6/Instructions!$C$24)*100","v":0},{"$f":"(M6/Instructions!$C$25)*100","v":0},{"$f":"(N6/Instructions!$C$26)*100","v":0},{"$f":"(O6/Instructions!$C$27)*100","v":0},{"$f":"(P6/Instructions!$C$28)*100","v":0},{"$f":"(Q6/Instructions!$C$29)*100","v":0},{"$f":"(R6/Instructions!$C$30)*100","v":0},{"$f":"(S6/Instructions!$C$31)*100","v":0},{"$f":"(T6/Instructions!$C$30)*100","v":0},{"$f":"(U6/Instructions!$C$33)*100","v":{"$error":"#VALUE!"}},"----","E","E","E","E","E","E","E","E","E","E","--"]
[6,null,null,null,null,null,null,null,null,null,null,null,null,null,null,null,null,null,null,null,"--",0,null,null,{"$f":"(K7/Instructions!$C$23)*100","v":0},{"$f":"(L7/Instructions!$C$24)*100","v":0},{"$f":"(M7/Instructions!$C$25)*100","v":0},{"$f":"(N7/Instructions!$C$26)*100","v":0},{"$f":"(O7/Instructions!$C$27)*100","v":0},{"$f":"(P7/Instructions!$C$28)*100","v":0},{"$f":"(Q7/Instructions!$C$29)*100","v":0},{"$f":"(R7/Instructions!$C$30)*100","v":0},{"$f":"(S7/Instructions!$C$31)*100","v":0},{"$f":"(T7/Instructions!$C$30)*100","v":0},{"$f":"(U7/Instructions!$C$33)*100","v":{"$error":"#VALUE!"}},"----","E","E","E","E","E","E","E","E","E","E","--"]
[7,null,null,null,null,null,null,null,null,null,null,null,null,null,null,null,null,null,null,null,"--",0,null,null,{"$f":"(K8/Instructions!$C$23)*100","v":0},{"$f":"(L8/Instructions!$C$24)*100","v":0},{"$f":"(M8/Instructions!$C$25)*100","v":0},{"$f":"(N8/Instructions!$C$26)*100","v":0},{"$f":"(O8/Instructions!$C$27)*100","v":0},{"$f":"(P8/Instructions!$C$28)*100","v":0},{"$f":"(Q8/Instructions!$C$29)*100","v":0},{"$f":"(R8/Instructions!$C$30)*100","v":0},{"$f":"(S8/Instructions!$C$31)*100","v":0},{"$f":"(T8/Instructions!$C$30)*100","v":0},{"$f":"(U8/Instructions!$C$33)*100","v":{"$error":"#VALUE!"}},"----","E","E","E","E","E","E","E","E","E","E","--"]
[8,null,null,null,null,null,null,null,null,null,null,null,null,null,null,null,null,null,null,null,"--",0,null,null,{"$f":"(K9/Instructions!$C$23)*100","v":0},{"$f":"(L9/Instructions!$C$24)*100","v":0},{"$f":"(M9/Instructions!$C$25)*100","v":0},{"$f":"(N9/Instructions!$C$26)*100","v":0},{"$f":"(O9/Instructions!$C$27)*100","v":0},{"$f":"(P9/Instructions!$C$28)*100","v":0},{"$f":"(Q9/Instructions!$C$29)*100","v":0},{"$f":"(R9/Instructions!$C$30)*100","v":0},{"$f":"(S9/Instructions!$C$31)*100","v":0},{"$f":"(T9/Instructions!$C$30)*100","v":0},{"$f":"(U9/Instructions!$C$33)*100","v":{"$error":"#VALUE!"}},"----","E","E","E","E","E","E","E","E","E","E","--"]
[9,null,null,null,null,null,null,null,null,null,null,null,null,null,null,null,null,null,null,null,"--",0,null,null,{"$f":"(K10/Instructions!$C$23)*100","v":0},{"$f":"(L10/Instructions!$C$24)*100","v":0},{"$f":"(M10/Instructions!$C$25)*100","v":0},{"$f":"(N10/Instructions!$C$26)*100","v":0},{"$f":"(O10/Instructions!$C$27)*100","v":0},{"$f":"(P10/Instructions!$C$28)*100","v":0},{"$f":"(Q10/Instructions!$C$29)*100","v":0},{"$f":"(R10/Instructions!$C$30)*100","v":0},{"$f":"(S10/Instructions!$C$31)*100","v":0},{"$f":"(T10/Instructions!$C$30)*100","v":0},{"$f":"(U10/Instructions!$C$33)*100","v":{"$error":"#VALUE!"}},"----","E","E","E","E","E","E","E","E","E","E","--"]
[10,null,null,null,null,null,null,null,null,null,null,null,null,null,null,null,null,null,null,null,"--",0,null,null,{"$f":"(K11/Instructions!$C$23)*100","v":0},{"$f":"(L11/Instructions!$C$24)*100","v":0},{"$f":"(M11/Instructions!$C$25)*100","v":0},{"$f":"(N11/Instructions!$C$26)*100","v":0},{"$f":"(O11/Instructions!$C$27)*100","v":0},{"$f":"(P11/Instructions!$C$28)*100","v":0},{"$f":"(Q11/Instructions!$C$29)*100","v":0},{"$f":"(R11/Instructions!$C$30)*100","v":0},{"$f":"(S11/Instructions!$C$31)*100","v":0},{"$f":"(T11/Instructions!$C$30)*100","v":0},{"$f":"(U11/Instructions!$C$33)*100","v":{"$error":"#VALUE!"}},"----","E","E","E","E","E","E","E","E","E","E","--"]
[11,null,null,null,null,null,null,null,null,null,null,null,null,null,null,null,null,null,null,null,"--",0,null,null,{"$f":"(K12/Instructions!$C$23)*100","v":0},{"$f":"(L12/Instructions!$C$24)*100","v":0},{"$f":"(M12/Instructions!$C$25)*100","v":0},{"$f":"(N12/Instructions!$C$26)*100","v":0},{"$f":"(O12/Instructions!$C$27)*100","v":0},{"$f":"(P12/Instructions!$C$28)*100","v":0},{"$f":"(Q12/Instructions!$C$29)*100","v":0},{"$f":"(R12/Instructions!$C$30)*100","v":0},{"$f":"(S12/Instructions!$C$31)*100","v":0},{"$f":"(T12/Instructions!$C$30)*100","v":0},{"$f":"(U12/Instructions!$C$33)*100","v":{"$error":"#VALUE!"}},"----","E","E","E","E","E","E","E","E","E","E","--"]
[12,null,null,null,null,null,null,null,null,null,null,null,null,null,null,null,null,null,null,null,"--",0,null,null,{"$f":"(K13/Instructions!$C$23)*100","v":0},{"$f":"(L13/Instructions!$C$24)*100","v":0},{"$f":"(M13/Instructions!$C$25)*100","v":0},{"$f":"(N13/Instructions!$C$26)*100","v":0},{"$f":"(O13/Instructions!$C$27)*100","v":0},{"$f":"(P13/Instructions!$C$28)*100","v":0},{"$f":"(Q13/Instructions!$C$29)*100","v":0},{"$f":"(R13/Instructions!$C$30)*100","v":0},{"$f":"(S13/Instructions!$C$31)*100","v":0},{"$f":"(T13/Instructions!$C$30)*100","v":0},{"$f":"(U13/Instructions!$C$33)*100","v":{"$error":"#VALUE!"}},"----","E","E","E","E","E","E","E","E","E","E","--",null,null,null,null,null,{"$f":"Table_2[[#This Row],[Column51]]&Table_2[[#This Row],[Column52]]&AW15","v":""}]
[13,null,null,null,null,null,null,null,null,null,null,null,null,null,null,null,null,null,null,null,"--",0,null,null,{"$f":"(K14/Instructions!$C$23)*100","v":0},{"$f":"(L14/Instructions!$C$24)*100","v":0},{"$f":"(M14/Instructions!$C$25)*100","v":0},{"$f":"(N14/Instructions!$C$26)*100","v":0},{"$f":"(O14/Instructions!$C$27)*100","v":0},{"$f":"(P14/Instructions!$C$28)*100","v":0},{"$f":"(Q14/Instructions!$C$29)*100","v":0},{"$f":"(R14/Instructions!$C$30)*100","v":0},{"$f":"(S14/Instructions!$C$31)*100","v":0},{"$f":"(T14/Instructions!$C$30)*100","v":0},{"$f":"(U14/Instructions!$C$33)*100","v":{"$error":"#VALUE!"}},"----","E","E","E","E","E","E","E","E","E","E","--",null,null,null,null,null,{"$f":"Table_2[[#This Row],[Column51]]&Table_2[[#This Row],[Column52]]&AW16","v":""}]
[14,null,null,null,null,null,null,null,null,null,null,null,null,null,null,null,null,null,null,null,"--",0,null,null,{"$f":"(K15/Instructions!$C$23)*100","v":0},{"$f":"(L15/Instructions!$C$24)*100","v":0},{"$f":"(M15/Instructions!$C$25)*100","v":0},{"$f":"(N15/Instructions!$C$26)*100","v":0},{"$f":"(O15/Instructions!$C$27)*100","v":0},{"$f":"(P15/Instructions!$C$28)*100","v":0},{"$f":"(Q15/Instructions!$C$29)*100","v":0},{"$f":"(R15/Instructions!$C$30)*100","v":0},{"$f":"(S15/Instructions!$C$31)*100","v":0},{"$f":"(T15/Instructions!$C$30)*100","v":0},{"$f":"(U15/Instructions!$C$33)*100","v":{"$error":"#VALUE!"}},"----","E","E","E","E","E","E","E","E","E","E","--",null,null,null,null,null,{"$f":"Table_2[[#This Row],[Column51]]&Table_2[[#This Row],[Column52]]&AW17","v":""}]
{"$rows_left_out":389}
{"sheet":"Report Card","index":2,"n_rows":39,"n_cols":18,"rows_kept":39,"cut":false,"hidden":false,"merged":[[5,0,5,10],[36,2,36,4],[30,1,30,4],[31,1,31,4],[32,1,32,4],[30,5,30,8],[31,5,31,8],[32,5,32,8],[26,1,26,9],[29,5,29,8],[29,1,29,4],[28,1,28,8],[7,4,7,7],[8,4,8,7],[8,8,8,9],[24,2,24,5],[20,2,20,5],[20,6,20,7],[24,6,24,7],[25,1,25,2],[25,3,25,4],[25,5,25,6],[23,2,23,5],[23,6,23,7],[1,0,1,3],[11,4,11,7],[11,8,11,9],[22,2,22,5],[22,6,22,7],[15,2,15,5],[15,6,15,7],[9,4,9,7],[9,8,9,9],[10,4,10,7],[10,8,10,9],[11,1,11,3],[12,1,12,9],[13,1,13,9],[14,2,14,5],[14,6,14,7],[38,8,38,10],[6,12,7,12],[9,1,9,3],[10,1,10,3],[7,1,7,3],[8,1,8,3],[21,2,21,5],[21,6,21,7],[16,2,16,5],[16,6,16,7],[17,2,17,5],[17,6,17,7],[18,2,18,5],[18,6,18,7],[19,2,19,5],[19,6,19,7]]}
[]
[{"$f":"\"        Serial No./\"&Q3&\"/\"&R3&\"/\"&N8","v":"        Serial No./March/2024/1"}]
[null,null,null,null,null,null,null,null,null,null,null,null,null,null,null,null,{"$f":"Instructions!C19","v":"March"},{"$f":"Instructions!B19","v":2024}]
[]
[null,null,null,null,null,null,null,null,null,null,null,null,"Total Number of Record",{"$f":"COUNTA('Marks Entry 6-8'!F:F)","v":1}]
[{"$f":"\"Report Card \"&Q3& \" - \"&R3","v":"Report Card March - 2024"}]
[null,null,null,null,null,null,null,null,null,null,null,null,"Sr No. of Record"]
[null,"Student Name        :",null,null,{"$f":"IFERROR(VLOOKUP($N$8,'Marks Entry 6-8'!$A$1:$AY$401,6,0),\"\")","v":0},null,null,null,null,null,null,null,null,1]
[null,"E-Punjab ID              :",null,null,{"$f":"IFERROR(VLOOKUP($N$8,'Marks Entry 6-8'!$A$1:$AY$401,5,0),\"\")","v":0}]
[null,"Father’s Name       :",null,null,{"$f":"IFERROR(VLOOKUP($N$8,'Marks Entry 6-8'!$A$1:$AY$401,7,0),\"\")","v":0}]
[null,"Mother’s Name     :",null,null,{"$f":"IFERROR(VLOOKUP($N$8,'Marks Entry 6-8'!$A$1:$AY$401,8,0),\"\")","v":0}]
[null,"Class & Section      :",null,null,{"$f":"IFERROR(VLOOKUP($N$8,'Marks Entry 6-8'!$A$1:$AY$401,3,0)&\" \"&VLOOKUP($N$8,'Marks Entry 6-8'!$A$1:$AY$401,4,0),\"\")","v":" "}]
[null,{"$f":"\"has secured subject wise marks and grade as mentioned below in School Examination held in \" & Q3 & \"  \"&R3","v":"has secured subject wise marks and grade as mentioned below in School Examination held in March  2024"}]
[]
[null,"Sr. no.","Subject Name",null,null,null,"Total Marks",null,"Marks Obtained","Grade"]
{"$rows_left_out":25}
{"sheet":"Abstract 6-8","index":3,"n_rows":14,"n_cols":16,"rows_kept":14,"cut":false,"hidden":false,"merged":[[0,0,0,10],[0,13,0,15],[13,1,13,4]]}
["Subject & Grade Wise  Students Counts Details",null,null,null,null,null,null,null,null,null,null,null,null,{"$f":"\"Topper of Class \"&B2","v":"Topper of Class 7th"}]
["Class","7th","Section","A",null,null,null,null,null,null,null,null,null,"Rank","Student Name","Marks"]
["Grade/Subject","Punjabi ","English","Hindi","Maths.","Science","Social Sci.","Computer Sci","Welcome Life","Drawing","Physical Edu.",null,null,1,"ASHISH",549]
["A+",{"$f":"COUNTIFS('Marks Entry 6-8'!$C:$C,$B$2,'Marks Entry 6-8'!$D:$D,$D$2,'Marks Entry 6-8'!AK:AK,$A4)","v":0},{"$f":"COUNTIFS('Marks Entry 6-8'!$C:$C,$B$2,'Marks Entry 6-8'!$D:$D,$D$2,'Marks Entry 6-8'!AL:AL,$A4)","v":0},{"$f":"COUNTIFS('Marks Entry 6-8'!$C:$C,$B$2,'Marks Entry 6-8'!$D:$D,$D$2,'Marks Entry 6-8'!AM:AM,$A4)","v":0},{"$f":"COUNTIFS('Marks Entry 6-8'!$C:$C,$B$2,'Marks Entry 6-8'!$D:$D,$D$2,'Marks Entry 6-8'!AN:AN,$A4)","v":0},{"$f":"COUNTIFS('Marks Entry 6-8'!$C:$C,$B$2,'Marks Entry 6-8'!$D:$D,$D$2,'Marks Entry 6-8'!AO:AO,$A4)","v":0},{"$f":"COUNTIFS('Marks Entry 6-8'!$C:$C,$B$2,'Marks Entry 6-8'!$D:$D,$D$2,'Marks Entry 6-8'!AP:AP,$A4)","v":0},{"$f":"COUNTIFS('Marks Entry 6-8'!$C:$C,$B$2,'Marks Entry 6-8'!$D:$D,$D$2,'Marks Entry 6-8'!AQ:AQ,$A4)","v":0},{"$f":"COUNTIFS('Marks Entry 6-8'!$C:$C,$B$2,'Marks Entry 6-8'!$D:$D,$D$2,'Marks Entry 6-8'!AR:AR,$A4)","v":0},{"$f":"COUNTIFS('Marks Entry 6-8'!$C:$C,$B$2,'Marks Entry 6-8'!$D:$D,$D$2,'Marks Entry 6-8'!AS:AS,$A4)","v":0},{"$f":"COUNTIFS('Marks Entry 6-8'!$C:$C,$B$2,'Marks Entry 6-8'!$D:$D,$D$2,'Marks Entry 6-8'!AT:AT,$A4)","v":0},null,null,2,"JASMEET KAUR",548]
["A",{"$f":"COUNTIFS('Marks Entry 6-8'!$C:$C,$B$2,'Marks Entry 6-8'!$D:$D,$D$2,'Marks Entry 6-8'!AK:AK,$A5)","v":0},{"$f":"COUNTIFS('Marks Entry 6-8'!$C:$C,$B$2,'Marks Entry 6-8'!$D:$D,$D$2,'Marks Entry 6-8'!AL:AL,$A5)","v":0},{"$f":"COUNTIFS('Marks Entry 6-8'!$C:$C,$B$2,'Marks Entry 6-8'!$D:$D,$D$2,'Marks Entry 6-8'!AM:AM,$A5)","v":0},{"$f":"COUNTIFS('Marks Entry 6-8'!$C:$C,$B$2,'Marks Entry 6-8'!$D:$D,$D$2,'Marks Entry 6-8'!AN:AN,$A5)","v":0},{"$f":"COUNTIFS('Marks Entry 6-8'!$C:$C,$B$2,'Marks Entry 6-8'!$D:$D,$D$2,'Marks Entry 6-8'!AO:AO,$A5)","v":0},{"$f":"COUNTIFS('Marks Entry 6-8'!$C:$C,$B$2,'Marks Entry 6-8'!$D:$D,$D$2,'Marks Entry 6-8'!AP:AP,$A5)","v":0},{"$f":"COUNTIFS('Marks Entry 6-8'!$C:$C,$B$2,'Marks Entry 6-8'!$D:$D,$D$2,'Marks Entry 6-8'!AQ:AQ,$A5)","v":0},{"$f":"COUNTIFS('Marks Entry 6-8'!$C:$C,$B$2,'Marks Entry 6-8'!$D:$D,$D$2,'Marks Entry 6-8'!AR:AR,$A5)","v":0},{"$f":"COUNTIFS('Marks Entry 6-8'!$C:$C,$B$2,'Marks Entry 6-8'!$D:$D,$D$2,'Marks Entry 6-8'!AS:AS,$A5)","v":0},{"$f":"COUNTIFS('Marks Entry 6-8'!$C:$C,$B$2,'Marks Entry 6-8'!$D:$D,$D$2,'Marks Entry 6-8'!AT:AT,$A5)","v":0},null,null,3,"KAMAL KUMAR",548]
["B+",{"$f":"COUNTIFS('Marks Entry 6-8'!$C:$C,$B$2,'Marks Entry 6-8'!$D:$D,$D$2,'Marks Entry 6-8'!AK:AK,$A6)","v":0},{"$f":"COUNTIFS('Marks Entry 6-8'!$C:$C,$B$2,'Marks Entry 6-8'!$D:$D,$D$2,'Marks Entry 6-8'!AL:AL,$A6)","v":0},{"$f":"COUNTIFS('Marks Entry 6-8'!$C:$C,$B$2,'Marks Entry 6-8'!$D:$D,$D$2,'Marks Entry 6-8'!AM:AM,$A6)","v":0},{"$f":"COUNTIFS('Marks Entry 6-8'!$C:$C,$B$2,'Marks Entry 6-8'!$D:$D,$D$2,'Marks Entry 6-8'!AN:AN,$A6)","v":0},{"$f":"COUNTIFS('Marks Entry 6-8'!$C:$C,$B$2,'Marks Entry 6-8'!$D:$D,$D$2,'Marks Entry 6-8'!AO:AO,$A6)","v":0},{"$f":"COUNTIFS('Marks Entry 6-8'!$C:$C,$B$2,'Marks Entry 6-8'!$D:$D,$D$2,'Marks Entry 6-8'!AP:AP,$A6)","v":0},{"$f":"COUNTIFS('Marks Entry 6-8'!$C:$C,$B$2,'Marks Entry 6-8'!$D:$D,$D$2,'Marks Entry 6-8'!AQ:AQ,$A6)","v":0},{"$f":"COUNTIFS('Marks Entry 6-8'!$C:$C,$B$2,'Marks Entry 6-8'!$D:$D,$D$2,'Marks Entry 6-8'!AR:AR,$A6)","v":0},{"$f":"COUNTIFS('Marks Entry 6-8'!$C:$C,$B$2,'Marks Entry 6-8'!$D:$D,$D$2,'Marks Entry 6-8'!AS:AS,$A6)","v":0},{"$f":"COUNTIFS('Marks Entry 6-8'!$C:$C,$B$2,'Marks Entry 6-8'!$D:$D,$D$2,'Marks Entry 6-8'!AT:AT,$A6)","v":0},null,null,4,"JASHANPREET SINGH",546]
["B",{"$f":"COUNTIFS('Marks Entry 6-8'!$C:$C,$B$2,'Marks Entry 6-8'!$D:$D,$D$2,'Marks Entry 6-8'!AK:AK,$A7)","v":0},{"$f":"COUNTIFS('Marks Entry 6-8'!$C:$C,$B$2,'Marks Entry 6-8'!$D:$D,$D$2,'Marks Entry 6-8'!AL:AL,$A7)","v":0},{"$f":"COUNTIFS('Marks Entry 6-8'!$C:$C,$B$2,'Marks Entry 6-8'!$D:$D,$D$2,'Marks Entry 6-8'!AM:AM,$A7)","v":0},{"$f":"COUNTIFS('Marks Entry 6-8'!$C:$C,$B$2,'Marks Entry 6-8'!$D:$D,$D$2,'Marks Entry 6-8'!AN:AN,$A7)","v":0},{"$f":"COUNTIFS('Marks Entry 6-8'!$C:$C,$B$2,'Marks Entry 6-8'!$D:$D,$D$2,'Marks Entry 6-8'!AO:AO,$A7)","v":0},{"$f":"COUNTIFS('Marks Entry 6-8'!$C:$C,$B$2,'Marks Entry 6-8'!$D:$D,$D$2,'Marks Entry 6-8'!AP:AP,$A7)","v":0},{"$f":"COUNTIFS('Marks Entry 6-8'!$C:$C,$B$2,'Marks Entry 6-8'!$D:$D,$D$2,'Marks Entry 6-8'!AQ:AQ,$A7)","v":0},{"$f":"COUNTIFS('Marks Entry 6-8'!$C:$C,$B$2,'Marks Entry 6-8'!$D:$D,$D$2,'Marks Entry 6-8'!AR:AR,$A7)","v":0},{"$f":"COUNTIFS('Marks Entry 6-8'!$C:$C,$B$2,'Marks Entry 6-8'!$D:$D,$D$2,'Marks Entry 6-8'!AS:AS,$A7)","v":0},{"$f":"COUNTIFS('Marks Entry 6-8'!$C:$C,$B$2,'Marks Entry 6-8'!$D:$D,$D$2,'Marks Entry 6-8'!AT:AT,$A7)","v":0},null,null,5,"SUJATA KUMARI",544]
["C+",{"$f":"COUNTIFS('Marks Entry 6-8'!$C:$C,$B$2,'Marks Entry 6-8'!$D:$D,$D$2,'Marks Entry 6-8'!AK:AK,$A8)","v":0},{"$f":"COUNTIFS('Marks Entry 6-8'!$C:$C,$B$2,'Marks Entry 6-8'!$D:$D,$D$2,'Marks Entry 6-8'!AL:AL,$A8)","v":0},{"$f":"COUNTIFS('Marks Entry 6-8'!$C:$C,$B$2,'Marks Entry 6-8'!$D:$D,$D$2,'Marks Entry 6-8'!AM:AM,$A8)","v":0},{"$f":"COUNTIFS('Marks Entry 6-8'!$C:$C,$B$2,'Marks Entry 6-8'!$D:$D,$D$2,'Marks Entry 6-8'!AN:AN,$A8)","v":0},{"$f":"COUNTIFS('Marks Entry 6-8'!$C:$C,$B$2,'Marks Entry 6-8'!$D:$D,$D$2,'Marks Entry 6-8'!AO:AO,$A8)","v":0},{"$f":"COUNTIFS('Marks Entry 6-8'!$C:$C,$B$2,'Marks Entry 6-8'!$D:$D,$D$2,'Marks Entry 6-8'!AP:AP,$A8)","v":0},{"$f":"COUNTIFS('Marks Entry 6-8'!$C:$C,$B$2,'Marks Entry 6-8'!$D:$D,$D$2,'Marks Entry 6-8'!AQ:AQ,$A8)","v":0},{"$f":"COUNTIFS('Marks Entry 6-8'!$C:$C,$B$2,'Marks Entry 6-8'!$D:$D,$D$2,'Marks Entry 6-8'!AR:AR,$A8)","v":0},{"$f":"COUNTIFS('Marks Entry 6-8'!$C:$C,$B$2,'Marks Entry 6-8'!$D:$D,$D$2,'Marks Entry 6-8'!AS:AS,$A8)","v":0},{"$f":"COUNTIFS('Marks Entry 6-8'!$C:$C,$B$2,'Marks Entry 6-8'!$D:$D,$D$2,'Marks Entry 6-8'!AT:AT,$A8)","v":0},null,null,6,"ROSHNI",538]
["C",{"$f":"COUNTIFS('Marks Entry 6-8'!$C:$C,$B$2,'Marks Entry 6-8'!$D:$D,$D$2,'Marks Entry 6-8'!AK:AK,$A9)","v":0},{"$f":"COUNTIFS('Marks Entry 6-8'!$C:$C,$B$2,'Marks Entry 6-8'!$D:$D,$D$2,'Marks Entry 6-8'!AL:AL,$A9)","v":0},{"$f":"COUNTIFS('Marks Entry 6-8'!$C:$C,$B$2,'Marks Entry 6-8'!$D:$D,$D$2,'Marks Entry 6-8'!AM:AM,$A9)","v":0},{"$f":"COUNTIFS('Marks Entry 6-8'!$C:$C,$B$2,'Marks Entry 6-8'!$D:$D,$D$2,'Marks Entry 6-8'!AN:AN,$A9)","v":0},{"$f":"COUNTIFS('Marks Entry 6-8'!$C:$C,$B$2,'Marks Entry 6-8'!$D:$D,$D$2,'Marks Entry 6-8'!AO:AO,$A9)","v":0},{"$f":"COUNTIFS('Marks Entry 6-8'!$C:$C,$B$2,'Marks Entry 6-8'!$D:$D,$D$2,'Marks Entry 6-8'!AP:AP,$A9)","v":0},{"$f":"COUNTIFS('Marks Entry 6-8'!$C:$C,$B$2,'Marks Entry 6-8'!$D:$D,$D$2,'Marks Entry 6-8'!AQ:AQ,$A9)","v":0},{"$f":"COUNTIFS('Marks Entry 6-8'!$C:$C,$B$2,'Marks Entry 6-8'!$D:$D,$D$2,'Marks Entry 6-8'!AR:AR,$A9)","v":0},{"$f":"COUNTIFS('Marks Entry 6-8'!$C:$C,$B$2,'Marks Entry 6-8'!$D:$D,$D$2,'Marks Entry 6-8'!AS:AS,$A9)","v":0},{"$f":"COUNTIFS('Marks Entry 6-8'!$C:$C,$B$2,'Marks Entry 6-8'!$D:$D,$D$2,'Marks Entry 6-8'!AT:AT,$A9)","v":0},null,null,7,"GAGANDEEP KAUR",536]
["D",{"$f":"COUNTIFS('Marks Entry 6-8'!$C:$C,$B$2,'Marks Entry 6-8'!$D:$D,$D$2,'Marks Entry 6-8'!AK:AK,$A10)","v":0},{"$f":"COUNTIFS('Marks Entry 6-8'!$C:$C,$B$2,'Marks Entry 6-8'!$D:$D,$D$2,'Marks Entry 6-8'!AL:AL,$A10)","v":0},{"$f":"COUNTIFS('Marks Entry 6-8'!$C:$C,$B$2,'Marks Entry 6-8'!$D:$D,$D$2,'Marks Entry 6-8'!AM:AM,$A10)","v":0},{"$f":"COUNTIFS('Marks Entry 6-8'!$C:$C,$B$2,'Marks Entry 6-8'!$D:$D,$D$2,'Marks Entry 6-8'!AN:AN,$A10)","v":0},{"$f":"COUNTIFS('Marks Entry 6-8'!$C:$C,$B$2,'Marks Entry 6-8'!$D:$D,$D$2,'Marks Entry 6-8'!AO:AO,$A10)","v":0},{"$f":"COUNTIFS('Marks Entry 6-8'!$C:$C,$B$2,'Marks Entry 6-8'!$D:$D,$D$2,'Marks Entry 6-8'!AP:AP,$A10)","v":0},{"$f":"COUNTIFS('Marks Entry 6-8'!$C:$C,$B$2,'Marks Entry 6-8'!$D:$D,$D$2,'Marks Entry 6-8'!AQ:AQ,$A10)","v":0},{"$f":"COUNTIFS('Marks Entry 6-8'!$C:$C,$B$2,'Marks Entry 6-8'!$D:$D,$D$2,'Marks Entry 6-8'!AR:AR,$A10)","v":0},{"$f":"COUNTIFS('Marks Entry 6-8'!$C:$C,$B$2,'Marks Entry 6-8'!$D:$D,$D$2,'Marks Entry 6-8'!AS:AS,$A10)","v":0},{"$f":"COUNTIFS('Marks Entry 6-8'!$C:$C,$B$2,'Marks Entry 6-8'!$D:$D,$D$2,'Marks Entry 6-8'!AT:AT,$A10)","v":0},null,null,8,"GURKANWAL SINGH",535]
["E",{"$f":"COUNTIFS('Marks Entry 6-8'!$C:$C,$B$2,'Marks Entry 6-8'!$D:$D,$D$2,'Marks Entry 6-8'!AK:AK,$A11)","v":0},{"$f":"COUNTIFS('Marks Entry 6-8'!$C:$C,$B$2,'Marks Entry 6-8'!$D:$D,$D$2,'Marks Entry 6-8'!AL:AL,$A11)","v":0},{"$f":"COUNTIFS('Marks Entry 6-8'!$C:$C,$B$2,'Marks Entry 6-8'!$D:$D,$D$2,'Marks Entry 6-8'!AM:AM,$A11)","v":0},{"$f":"COUNTIFS('Marks Entry 6-8'!$C:$C,$B$2,'Marks Entry 6-8'!$D:$D,$D$2,'Marks Entry 6-8'!AN:AN,$A11)","v":0},{"$f":"COUNTIFS('Marks Entry 6-8'!$C:$C,$B$2,'Marks Entry 6-8'!$D:$D,$D$2,'Marks Entry 6-8'!AO:AO,$A11)","v":0},{"$f":"COUNTIFS('Marks Entry 6-8'!$C:$C,$B$2,'Marks Entry 6-8'!$D:$D,$D$2,'Marks Entry 6-8'!AP:AP,$A11)","v":0},{"$f":"COUNTIFS('Marks Entry 6-8'!$C:$C,$B$2,'Marks Entry 6-8'!$D:$D,$D$2,'Marks Entry 6-8'!AQ:AQ,$A11)","v":0},{"$f":"COUNTIFS('Marks Entry 6-8'!$C:$C,$B$2,'Marks Entry 6-8'!$D:$D,$D$2,'Marks Entry 6-8'!AR:AR,$A11)","v":0},{"$f":"COUNTIFS('Marks Entry 6-8'!$C:$C,$B$2,'Marks Entry 6-8'!$D:$D,$D$2,'Marks Entry 6-8'!AS:AS,$A11)","v":0},{"$f":"COUNTIFS('Marks Entry 6-8'!$C:$C,$B$2,'Marks Entry 6-8'!$D:$D,$D$2,'Marks Entry 6-8'!AT:AT,$A11)","v":0},null,null,9,"GOLU SINGH",535]
["Total Student",{"$f":"SUM(B4:B11)","v":0},{"$f":"SUM(C4:C11)","v":0},0,0,0,0,0,0,0,0,null,null,10,"DALJEET SINGH",532]
[]
[null,"Total Fail/Reappear Students ",null,null,null,{"$f":"COUNTIFS('Marks Entry 6-8'!C2:C500,B2,'Marks Entry 6-8'!V2:V500,0)","v":0}]