{"text_format":"1","workbook":"xlsx","n_sheets":4,"sheets":["Instructions","Marks Entry 6-8","Report Card","Abstract 6-8"],"not_rendered":{"charts":1,"images":2,"macros":1,"external_links":1,"defined_names":3,"comments":0,"pivot_tables":0},"unopened":[],"bounds":{"document_bytes":16777216,"sheet_cells":100000,"rows_first":2000,"rows_last":500,"rows_between":2000,"halvings":0,"cell_chars":16384,"cell_head_chars":4096},"cells_cut":0,"cells_raw":0,"read":"whole","date_system":"1900"}

{"sheet":"Instructions","index":0,"n_rows":33,"n_cols":12,"rows_kept":33,"cut":false,"hidden":false,"merged":[[0,0,0,5],[16,1,16,2],[21,1,21,2],[8,1,8,4],[3,1,3,2],[4,1,4,5],[9,1,9,4],[6,1,6,6],[7,1,7,6]]}
["Instructions",null,null,null,null,null,null,null,null,null,"Year","Month"]
["Kindly read All Instructions before Use Report Card Utitly",null,null,null,null,null,null,null,null,null,2022,"Sept"]
[null,null,null,null,null,null,null,null,null,null,2023,"March"]
[1,"First Fill  Necessary Data for report card by click on ",null,"Fill Data",null,null,null,null,null,null,2024]
[2,"In All Sheet Use only or Click on  Yellow coloured Filled  Cell to Enter or Select Data. Rest Cells Are Locked",null,null,null,null,null,null,null,null,2025]
[3,"Now Goto Marks Entry Sheet 6-8 . Then Enter Data ( Marks) in Yellow cell thier",null,null,null,null,null,null,null,null,2026]
[4,"Enter Subjects Total Marks for Each Subject in this sheet at Row no . 20 onwards",null,null,null,null,null,null,null,null,2027]
[5,"You can find Grade Wise , Class Wise , Subject Wise Students count and Topper List",null,null,null,null,null,null,null,null,2028]
[6,"you can copy Paste Students Data Like Name ,Father Name, Class Etc.  From Epunjab Student Report Excel File",null,null,null,null,null,null,null,null,2029]
[7,"After Entered All data in yellow cell of Marks Entry 6-8 Sheet . Goto Report Card to View/Print report card of each Students",null,null,null,null,null,null,null,null,2030]
[]
[]
[]
[]
[]
[]
[null,"Select to  Fill Data"]
[null,"Select Year Below","Select Month"]
[null,2024,"March"]
[null,"Enter Date of Report Card Preparation","2024-03-31"]
[]
[null,"Enter Maximum Subject Marks"]
[null,"Punjabi",100]
[null,"English",100]
[null,"Hindi",100]
[null,"Maths",100]
[null,"Science",100]
[null,"social Sci.",100]
[null,"Computer Sci",100]
[null,"Physical Edu.",100]
[null,"Drawing",100,null,{"$f":"UPPER(B31)","v":"DRAWING"}]
[]
[null,"Grand Total (Except Grading Subject)",{"$f":"SUM(C23:C28)","v":600}]

{"sheet":"Marks Entry 6-8","index":1,"n_rows":403,"n_cols":53,"rows_kept":403,"cut":false,"hidden":false,"merged":[]}
["Sno",null,"Class","Sec","Student ID","Name","FatherName","MotherName","DOB","Gender","Punjabi","English","Hindi","Maths","Science","social Sci.","Computer Sci",null,{"$f":"Instructions!B31","v":"Drawing"},"Physical Edu.","Total Marks ","Total w/o F",null,"Option","Pbi%","Eng","Hindi","Maths.","Science","social Sci.","Com Sci","Welcome Life","Drawing",{"$f":"T1","v":"Physical Edu."},"Total %","Pass/Fail","Pbi Grade. ","Eng","Hindi","Maths.","Science","SS","Com Sci","WL","Drg","Phy","Grade total","%age dr/ph","Dr/Ph Grade","Dr/phy Total marks",null,null,{"$f":"Table_2[[#This Row],[Column51]]&Table_2[[#This Row],[Column52]]&AW3","v":""}]
[1,null,null,null,null,null,null,null,null,null,null,null,null,null,null,null,null,null,null,null,{"$f":"IF(MIN(Y2:AD2)>=33,SUM(K2:P2),\"--\")","v":"--"},{"$f":"IF(U2=\"--\",0,U2)","v":0},null,null,{"$f":"(K2/Instructions!$C$23)*100","v":0},{"$f":"(L2/Instructions!$C$24)*100","v":0},{"$f":"(M2/Instructions!$C$25)*100","v":0},{"$f":"(N2/Instructions!$C$26)*100","v":0},{"$f":"(O2/Instructions!$C$27)*100","v":0},{"$f":"(P2/Instructions!$C$28)*100","v":0},{"$f":"(Q2/Instructions!$C$29)*100","v":0},{"$f":"(R2/Instructions!$C$30)*100","v":0},{"$f":"(S2/Instructions!$C$31)*100","v":0},{"$f":"(T2/Instructions!$C$30)*100","v":0},{"$f":"(U2/Instructions!$C$33)*100","v":{"$error":"#VALUE!"}},{"$f":"IF(AND(Y2>=33,Z2>=33,AA2>=33,AB2>=33,AC2>=33,AD2>=33),\"PASS\",\"----\")","v":"----"},{"$f":"IFERROR(IF(Y2>90,\"A+\",IF(Y2>80,\"A\",IF(Y2>70,\"B+\",IF(Y2>60,\"B\",IF(Y2>50,\"C+\",IF(Y2>40,\"C\",IF(Y2>=33,\"D\",\"E\"))))))),\"Abs\")","v":"E"},"E","E","E","E","E","E","E","E","E",{"$f":"IFERROR(IF(AI2>90,\"A+\",IF(AI2>80,\"A\",IF(AI2>70,\"B+\",IF(AI2>60,\"B\",IF(AI2>50,\"C+\",IF(AI2>40,\"C\",IF(AI2>=33,\"D\",\"E\"))))))),\"--\")","v":"--"},null,null,null,null,null,{"$f":"Table_2[[#This Row],[Column51]]&Table_2[[#This Row],[Column52]]&AW4","v":""}]
[2,null,null,null,null,null,null,null,null,null,null,null,null,null,null,null,null,null,null,null,{"$f":"IF(MIN(Y3:AD3)>=33,SUM(K3:P3),\"--\")","v":"--"},{"$f":"IF(U3=\"--\",0,U3)","v":0},null,null,{"$f":"(K3/Instructions!$C$23)*100","v":0},{"$f":"(L3/Instructions!$C$24)*100","v":0},{"$f":"(M3/Instructions!$C$25)*100","v":0},{"$f":"(N3/Instructions!$C$26)*100","v":0},{"$f":"(O3/Instructions!$C$27)*100","v":0},{"$f":"(P3/Instructions!$C$28)*100","v":0},{"$f":"(Q3/Instructions!$C$29)*100","v":0},{"$f":"(R3/Instructions!$C$30)*100","v":0},{"$f":"(S3/Instructions!$C$31)*100","v":0},{"$f":"(T3/Instructions!$C$30)*100","v":0},{"$f":"IFERROR((U3/Instructions!$C$33)*100,\"--\")","v":"--"},{"$f":"IF(AND(Y3>=33,Z3>=33,AA3>=33,AB3>=33,AC3>=33,AD3>=33),\"PASS\",\"----\")","v":"----"},"E","E","E","E","E","E","E","E","E","E",{"$f":"IFERROR(IF(AI3>90,\"A+\",IF(AI3>80,\"A\",IF(AI3>70,\"B+\",IF(AI3>60,\"B\",IF(AI3>50,\"C+\",IF(AI3>40,\"C\",IF(AI3>=33,\"D\",\"E\"))))))),\"--\")","v":"A+"},null,null,null,null,null,{"$f":"Table_2[[#This Row],[Column51]]&Table_2[[#This Row],[Column52]]&AW5","v":""}]
[3,null,null,null,null,null,null,null,null,null,null,null,null,null,null,null,null,null,null,null,"--",0,null,null,{"$f":"(K4/Instructions!$C$23)*100","v":0},{"$f":"(L4/Instructions!$C$24)*100","v":0},{"$f":"(M4/Instructions!$C$25)*100","v":0},{"$f":"(N4/Instructions!$C$26)*100","v":0},{"$f":"(O4/Instructions!$C$27)*100","v":0},{"$f":"(P4/Instructions!$C$28)*100","v":0},{"$f":"(Q4/Instructions!$C$29)*100","v":0},{"$f":"(R4/Instructions!$C$30)*100","v":0},{"$f":"(S4/Instructions!$C$31)*100","v":0},{"$f":"(T4/Instructions!$C$30)*100","v":0},{"$f":"(U4/Instructions!$C$33)*100","v":{"$error":"#VALUE!"}},"----","E","E","E","E","E","E","E","E","E","E","--"]
[4,null,null,null,null,null,null,null,null,null,null,null,null,null,null,null,null,null,null,null,"--",0,null,null,{"$f":"(K5/Instructions!$C$23)*100","v":0},{"$f":"(L5/Instructions!$C$24)*100","v":0},{"$f":"(M5/Instructions!$C$25)*100","v":0},{"$f":"(N5/Instructions!$C$26)*100","v":0},{"$f":"(O5/Instructions!$C$27)*100","v":0},{"$f":"(P5/Instructions!$C$28)*100","v":0},{"$f":"(Q5/Instructions!$C$29)*100","v":0},{"$f":"(R5/Instructions!$C$30)*100","v":0},{"$f":"(S5/Instructions!$C$31)*100","v":0},{"$f":"(T5/Instructions!$C$30)*100","v":0},{"$f":"(U5/Instructions!$C$33)*100","v":{"$error":"#VALUE!"}},"----","E","E","E","E","E","E","E","E","E","E","--"]
[5,null,null,null,null,null,null,null,null,null,null,null,null,null,null,null,null,null,null,null,"--",0,null,null,{"$f":"(K6/Instructions!$C$23)*100","v":0},{"$f":"(L6/Instructions!$C$24)*100","v":0},{"$f":"(M6/Instructions!$C$25)*100","v":0},{"$f":"(N6/Instructions!$C$26)*100","v":0},{"$f":"(O6/Instructions!$C$27)*100","v":0},{"$f":"(P6/Instructions!$C$28)*100","v":0},{"$f":"(Q6/Instructions!$C$29)*100","v":0},{"$f":"(R6/Instructions!$C$30)*100","v":0},{"$f":"(S6/Instructions!$C$31)*100","v":0},{"$f":"(T6/Instructions!$C$30)*100","v":0},{"$f":"(U6/Instructions!$C$33)*100","v":{"$error":"#VALUE!"}},"----","E","E","E","E","E","E","E","E","E","E","--"]
[6,null,null,null,null,null,null,null,null,null,null,null,null,null,null,null,null,null,null,null,"--",0,null,null,{"$f":"(K7/Instructions!$C$23)*100","v":0},{"$f":"(L7/Instructions!$C$24)*100","v":0},{"$f":"(M7/Instructions!$C$25)*100","v":0},{"$f":"(N7/Instructions!$C$26)*100","v":0},{"$f":"(O7/Instructions!$C$27)*100","v":0},{"$f":"(P7/Instructions!$C$28)*100","v":0},{"$f":"(Q7/Instructions!$C$29)*100","v":0},{"$f":"(R7/Instructions!$C$30)*100","v":0},{"$f":"(S7/Instructions!$C$31)*100","v":0},{"$f":"(T7/Instructions!$C$30)*100","v":0},{"$f":"(U7/Instructions!$C$33)*100","v":{"$error":"#VALUE!"}},"----","E","E","E","E","E","E","E","E","E","E","--"]
[7,null,null,null,null,null,null,null,null,null,null,null,null,null,null,null,null,null,null,null,"--",0,null,null,{"$f":"(K8/Instructions!$C$23)*100","v":0},{"$f":"(L8/Instructions!$C$24)*100","v":0},{"$f":"(M8/Instructions!$C$25)*100","v":0},{"$f":"(N8/Instructions!$C$26)*100","v":0},{"$f":"(O8/Instructions!$C$27)*100","v":0},{"$f":"(P8/Instructions!$C$28)*100","v":0},{"$f":"(Q8/Instructions!$C$29)*100","v":0},{"$f":"(R8/Instructions!$C$30)*100","v":0},{"$f":"(S8/Instructions!$C$31)*100","v":0},{"$f":"(T8/Instructions!$C$30)*100","v":0},{"$f":"(U8/Instructions!$C$33)*100","v":{"$error":"#VALUE!"}},"----","E","E","E","E","E","E","E","E","E","E","--"]
[8,null,null,null,null,null,null,null,null,null,null,null,null,null,null,null,null,null,null,null,"--",0,null,null,{"$f":"(K9/Instructions!$C$23)*100","v":0},{"$f":"(L9/Instructions!$C$24)*100","v":0},{"$f":"(M9/Instructions!$C$25)*100","v":0},{"$f":"(N9/Instructions!$C$26)*100","v":0},{"$f":"(O9/Instructions!$C$27)*100","v":0},{"$f":"(P9/Instructions!$C$28)*100","v":0},{"$f":"(Q9/Instructions!$C$29)*100","v":0},{"$f":"(R9/Instructions!$C$30)*100","v":0},{"$f":"(S9/Instructions!$C$31)*100","v":0},{"$f":"(T9/Instructions!$C$30)*100","v":0},{"$f":"(U9/Instructions!$C$33)*100","v":{"$error":"#VALUE!"}},"----","E","E","E","E","E","E","E","E","E","E","--"]
[9,null,null,null,null,null,null,null,null,null,null,null,null,null,null,null,null,null,null,null,"--",0,null,null,{"$f":"(K10/Instructions!$C$23)*100","v":0},{"$f":"(L10/Instructions!$C$24)*100","v":0},{"$f":"(M10/Instructions!$C$25)*100","v":0},{"$f":"(N10/Instructions!$C$26)*100","v":0},{"$f":"(O10/Instructions!$C$27)*100","v":0},{"$f":"(P10/Instructions!$C$28)*100","v":0},{"$f":"(Q10/Instructions!$C$29)*100","v":0},{"$f":"(R10/Instructions!$C$30)*100","v":0},{"$f":"(S10/Instructions!$C$31)*100","v":0},{"$f":"(T10/Instructions!$C$30)*100","v":0},{"$f":"(U10/Instructions!$C$33)*100","v":{"$error":"#VALUE!"}},"----","E","E","E","E","E","E","E","E","E","E","--"]
[10,null,null,null,null,null,null,null,null,null,null,null,null,null,null,null,null,null,null,null,"--",0,null,null,{"$f":"(K11/Instructions!$C$23)*100","v":0},{"$f":"(L11/Instructions!$C$24)*100","v":0},{"$f":"(M11/Instructions!$C$25)*100","v":0},{"$f":"(N11/Instructions!$C$26)*100","v":0},{"$f":"(O11/Instructions!$C$27)*100","v":0},{"$f":"(P11/Instructions!$C$28)*100","v":0},{"$f":"(Q11/Instructions!$C$29)*100","v":0},{"$f":"(R11/Instructions!$C$30)*100","v":0},{"$f":"(S11/Instructions!$C$31)*100","v":0},{"$f":"(T11/Instructions!$C$30)*100","v":0},{"$f":"(U11/Instructions!$C$33)*100","v":{"$error":"#VALUE!"}},"----","E","E","E","E","E","E","E","E","E","E","--"]
[11,null,null,null,null,null,null,null,null,null,null,null,null,null,null,null,null,null,null,null,"--",0,null,null,{"$f":"(K12/Instructions!$C$23)*100","v":0},{"$f":"(L12/Instructions!$C$24)*100","v":0},{"$f":"(M12/Instructions!$C$25)*100","v":0},{"$f":"(N12/Instructions!$C$26)*100","v":0},{"$f":"(O12/Instructions!$C$27)*100","v":0},{"$f":"(P12/Instructions!$C$28)*100","v":0},{"$f":"(Q12/Instructions!$C$29)*100","v":0},{"$f":"(R12/Instructions!$C$30)*100","v":0},{"$f":"(S12/Instructions!$C$31)*100","v":0},{"$f":"(T12/Instructions!$C$30)*100","v":0},{"$f":"(U12/Instructions!$C$33)*100","v":{"$error":"#VALUE!"}},"----","E","E","E","E","E","E","E","E","E","E","--"]
[12,null,null,null,null,null,null,null,null,null,null,null,null,null,null,null,null,null,null,null,"--",0,null,null,{"$f":"(K13/Instructions!$C$23)*100","v":0},{"$f":"(L13/Instructions!$C$24)*100","v":0},{"$f":"(M13/Instructions!$C$25)*100","v":0},{"$f":"(N13/Instructions!$C$26)*100","v":0},{"$f":"(O13/Instructions!$C$27)*100","v":0},{"$f":"(P13/Instructions!$C$28)*100","v":0},{"$f":"(Q13/Instructions!$C$29)*100","v":0},{"$f":"(R13/Instructions!$C$30)*100","v":0},{"$f":"(S13/Instructions!$C$31)*100","v":0},{"$f":"(T13/Instructions!$C$30)*100","v":0},{"$f":"(U13/Instructions!$C$33)*100","v":{"$error":"#VALUE!"}},"----","E","E","E","E","E","E","E","E","E","E","--",null,null,null,null,null,{"$f":"Table_2[[#This Row],[Column51]]&Table_2[[#This Row],[Column52]]&AW15","v":""}]
[13,null,null,null,null,null,null,null,null,null,null,null,null,null,null,null,null,null,null,null,"--",0,null,null,{"$f":"(K14/Instructions!$C$23)*100","v":0},{"$f":"(L14/Instructions!$C$24)*100","v":0},{"$f":"(M14/Instructions!$C$25)*100","v":0},{"$f":"(N14/Instructions!$C$26)*100","v":0},{"$f":"(O14/Instructions!$C$27)*100","v":0},{"$f":"(P14/Instructions!$C$28)*100","v":0},{"$f":"(Q14/Instructions!$C$29)*100","v":0},{"$f":"(R14/Instructions!$C$30)*100","v":0},{"$f":"(S14/Instructions!$C$31)*100","v":0},{"$f":"(T14/Instructions!$C$30)*100","v":0},{"$f":"(U14/Instructions!$C$33)*100","v":{"$error":"#VALUE!"}},"----","E","E","E","E","E","E","E","E","E","E","--",null,null,null,null,null,{"$f":"Table_2[[#This Row],[Column51]]&Table_2[[#This Row],[Column52]]&AW16","v":""}]
[14,null,null,null,null,null,null,null,null,null,null,null,null,null,null,null,null,null,null,null,"--",0,null,null,{"$f":"(K15/Instructions!$C$23)*100","v":0},{"$f":"(L15/Instructions!$C$24)*100","v":0},{"$f":"(M15/Instructions!$C$25)*100","v":0},{"$f":"(N15/Instructions!$C$26)*100","v":0},{"$f":"(O15/Instructions!$C$27)*100","v":0},{"$f":"(P15/Instructions!$C$28)*100","v":0},{"$f":"(Q15/Instructions!$C$29)*100","v":0},{"$f":"(R15/Instructions!$C$30)*100","v":0},{"$f":"(S15/Instructions!$C$31)*100","v":0},{"$f":"(T15/Instructions!$C$30)*100","v":0},{"$f":"(U15/Instructions!$C$33)*100","v":{"$error":"#VALUE!"}},"----","E","E","E","E","E","E","E","E","E","E","--",null,null,null,null,null,{"$f":"Table_2[[#This Row],[Column51]]&Table_2[[#This Row],[Column52]]&AW17","v":""}]
[15,null,null,null,null,null,null,null,null,null,null,null,null,null,null,null,null,null,null,null,"--",0,null,null,{"$f":"(K16/Instructions!$C$23)*100","v":0},{"$f":"(L16/Instructions!$C$24)*100","v":0},{"$f":"(M16/Instructions!$C$25)*100","v":0},{"$f":"(N16/Instructions!$C$26)*100","v":0},{"$f":"(O16/Instructions!$C$27)*100","v":0},{"$f":"(P16/Instructions!$C$28)*100","v":0},{"$f":"(Q16/Instructions!$C$29)*100","v":0},{"$f":"(R16/Instructions!$C$30)*100","v":0},{"$f":"(S16/Instructions!$C$31)*100","v":0},{"$f":"(T16/Instructions!$C$30)*100","v":0},{"$f":"(U16/Instructions!$C$33)*100","v":{"$error":"#VALUE!"}},"----","E","E","E","E","E","E","E","E","E","E","--",null,null,null,null,null,{"$f":"Table_2[[#This Row],[Column51]]&Table_2[[#This Row],[Column52]]&AW18","v":""}]
[16,null,null,null,null,null,null,null,null,null,null,null,null,null,null,null,null,null,null,null,"--",0,null,null,{"$f":"(K17/Instructions!$C$23)*100","v":0},{"$f":"(L17/Instructions!$C$24)*100","v":0},{"$f":"(M17/Instructions!$C$25)*100","v":0},{"$f":"(N17/Instructions!$C$26)*100","v":0},{"$f":"(O17/Instructions!$C$27)*100","v":0},{"$f":"(P17/Instructions!$C$28)*100","v":0},{"$f":"(Q17/Instructions!$C$29)*100","v":0},{"$f":"(R17/Instructions!$C$30)*100","v":0},{"$f":"(S17/Instructions!$C$31)*100","v":0},{"$f":"(T17/Instructions!$C$30)*100","v":0},{"$f":"(U17/Instructions!$C$33)*100","v":{"$error":"#VALUE!"}},"----","E","E","E","E","E","E","E","E","E","E","--",null,null,null,null,null,{"$f":"Table_2[[#This Row],[Column51]]&Table_2[[#This Row],[Column52]]&AW19","v":""}]
[17,null,null,null,null,null,null,null,null,null,null,null,null,null,null,null,null,null,null,null,"--",0,null,null,{"$f":"(K18/Instructions!$C$23)*100","v":0},{"$f":"(L18/Instructions!$C$24)*100","v":0},{"$f":"(M18/Instructions!$C$25)*100","v":0},{"$f":"(N18/Instructions!$C$26)*100","v":0},{"$f":"(O18/Instructions!$C$27)*100","v":0},{"$f":"(P18/Instructions!$C$28)*100","v":0},{"$f":"(Q18/Instructions!$C$29)*100","v":0},{"$f":"(R18/Instructions!$C$30)*100","v":0},{"$f":"(S18/Instructions!$C$31)*100","v":0},{"$f":"(T18/Instructions!$C$30)*100","v":0},{"$f":"(U18/Instructions!$C$33)*100","v":{"$error":"#VALUE!"}},"----",{"$f":"IFERROR(IF(Y18>90,\"A+\",IF(Y18>80,\"A\",IF(Y18>70,\"B+\",IF(Y18>60,\"B\",IF(Y18>50,\"C+\",IF(Y18>40,\"C\",IF(Y18>=33,\"D\",\"E\"))))))),\"Abs\")","v":"E"},"E","E","E","E","E","E","E","E","E","--",null,null,null,null,null,{"$f":"Table_2[[#This Row],[Column51]]&Table_2[[#This Row],[Column52]]&AW20","v":""}]
[18,null,null,null,null,null,null,null,null,null,null,null,null,null,null,null,null,null,null,null,"--",0,null,null,{"$f":"(K19/Instructions!$C$23)*100","v":0},{"$f":"(L19/Instructions!$C$24)*100","v":0},{"$f":"(M19/Instructions!$C$25)*100","v":0},{"$f":"(N19/Instructions!$C$26)*100","v":0},{"$f":"(O19/Instructions!$C$27)*100","v":0},{"$f":"(P19/Instructions!$C$28)*100","v":0},{"$f":"(Q19/Instructions!$C$29)*100","v":0},{"$f":"(R19/Instructions!$C$30)*100","v":0},{"$f":"(S19/Instructions!$C$31)*100","v":0},{"$f":"(T19/Instructions!$C$30)*100","v":0},{"$f":"(U19/Instructions!$C$33)*100","v":{"$error":"#VALUE!"}},"----","E","E","E","E","E","E","E","E","E","E","--",null,null,null,null,null,{"$f":"Table_2[[#This Row],[Column51]]&Table_2[[#This Row],[Column52]]&AW21","v":""}]
[19,null,null,null,null,null,null,null,null,null,null,null,null,null,null,null,null,null,null,null,"--",0,null,null,{"$f":"(K20/Instructions!$C$23)*100","v":0},{"$f":"(L20/Instructions!$C$24)*100","v":0},{"$f":"(M20/Instructions!$C$25)*100","v":0},{"$f":"(N20/Instructions!$C$26)*100","v":0},{"$f":"(O20/Instructions!$C$27)*100","v":0},{"$f":"(P20/Instructions!$C$28)*100","v":0},{"$f":"(Q20/Instructions!$C$29)*100","v":0},{"$f":"(R20/Instructions!$C$30)*100","v":0},{"$f":"(S20/Instructions!$C$31)*100","v":0},{"$f":"(T20/Instructions!$C$30)*100","v":0},{"$f":"(U20/Instructions!$C$33)*100","v":{"$error":"#VALUE!"}},"----","E","E","E","E","E","E","E","E","E","E","--",null,null,null,null,null,{"$f":"Table_2[[#This Row],[Column51]]&Table_2[[#This Row],[Column52]]&AW22","v":""}]
[20,null,null,null,null,null,null,null,null,null,null,null,null,null,null,null,null,null,null,null,"--",0,null,null,{"$f":"(K21/Instructions!$C$23)*100","v":0},{"$f":"(L21/Instructions!$C$24)*100","v":0},{"$f":"(M21/Instructions!$C$25)*100","v":0},{"$f":"(N21/Instructions!$C$26)*100","v":0},{"$f":"(O21/Instructions!$C$27)*100","v":0},{"$f":"(P21/Instructions!$C$28)*100","v":0},{"$f":"(Q21/Instructions!$C$29)*100","v":0},{"$f":"(R21/Instructions!$C$30)*100","v":0},{"$f":"(S21/Instructions!$C$31)*100","v":0},{"$f":"(T21/Instructions!$C$30)*100","v":0},{"$f":"(U21/Instructions!$C$33)*100","v":{"$error":"#VALUE!"}},"----","E","E","E","E","E","E","E","E","E","E","--",null,null,null,null,null,{"$f":"Table_2[[#This Row],[Column51]]&Table_2[[#This Row],[Column52]]&AW23","v":""}]
[21,null,null,null,null,null,null,null,null,null,null,null,null,null,null,null,null,null,null,null,"--",0,null,null,{"$f":"(K22/Instructions!$C$23)*100","v":0},{"$f":"(L22/Instructions!$C$24)*100","v":0},{"$f":"(M22/Instructions!$C$25)*100","v":0},{"$f":"(N22/Instructions!$C$26)*100","v":0},{"$f":"(O22/Instructions!$C$27)*100","v":0},{"$f":"(P22/Instructions!$C$28)*100","v":0},{"$f":"(Q22/Instructions!$C$29)*100","v":0},{"$f":"(R22/Instructions!$C$30)*100","v":0},{"$f":"(S22/Instructions!$C$31)*100","v":0},{"$f":"(T22/Instructions!$C$30)*100","v":0},{"$f":"(U22/Instructions!$C$33)*100","v":{"$error":"#VALUE!"}},"----","E","E","E","E","E","E","E","E","E","E","--",null,null,null,null,null,{"$f":"Table_2[[#This Row],[Column51]]&Table_2[[#This Row],[Column52]]&AW24","v":""}]
[22,null,null,null,null,null,null,null,null,null,null,null,null,null,null,null,null,null,null,null,"--",0,null,null,{"$f":"(K23/Instructions!$C$23)*100","v":0},{"$f":"(L23/Instructions!$C$24)*100","v":0},{"$f":"(M23/Instructions!$C$25)*100","v":0},{"$f":"(N23/Instructions!$C$26)*100","v":0},{"$f":"(O23/Instructions!$C$27)*100","v":0},{"$f":"(P23/Instructions!$C$28)*100","v":0},{"$f":"(Q23/Instructions!$C$29)*100","v":0},{"$f":"(R23/Instructions!$C$30)*100","v":0},{"$f":"(S23/Instructions!$C$31)*100","v":0},{"$f":"(T23/Instructions!$C$30)*100","v":0},{"$f":"(U23/Instructions!$C$33)*100","v":{"$error":"#VALUE!"}},"----","E","E","E","E","E","E","E","E","E","E","--",null,null,null,null,null,{"$f":"Table_2[[#This Row],[Column51]]&Table_2[[#This Row],[Column52]]&AW25","v":""}]
[23,null,null,null,null,null,null,null,null,null,null,null,null,null,null,null,null,null,null,null,"--",0,null,null,{"$f":"(K24/Instructions!$C$23)*100","v":0},{"$f":"(L24/Instructions!$C$24)*100","v":0},{"$f":"(M24/Instructions!$C$25)*100","v":0},{"$f":"(N24/Instructions!$C$26)*100","v":0},{"$f":"(O24/Instructions!$C$27)*100","v":0},{"$f":"(P24/Instructions!$C$28)*100","v":0},{"$f":"(Q24/Instructions!$C$29)*100","v":0},{"$f":"(R24/Instructions!$C$30)*100","v":0},{"$f":"(S24/Instructions!$C$31)*100","v":0},{"$f":"(T24/Instructions!$C$30)*100","v":0},{"$f":"(U24/Instructions!$C$33)*100","v":{"$error":"#VALUE!"}},"----","E","E","E","E","E","E","E","E","E","E","--",null,null,null,null,null,{"$f":"Table_2[[#This Row],[Column51]]&Table_2[[#This Row],[Column52]]&AW26","v":""}]
[24,null,null,null,null,null,null,null,null,null,null,null,null,null,null,null,null,null,null,null,"--",0,null,null,{"$f":"(K25/Instructions!$C$23)*100","v":0},{"$f":"(L25/Instructions!$C$24)*100","v":0},{"$f":"(M25/Instructions!$C$25)*100","v":0},{"$f":"(N25/Instructions!$C$26)*100","v":0},{"$f":"(O25/Instructions!$C$27)*100","v":0},{"$f":"(P25/Instructions!$C$28)*100","v":0},{"$f":"(Q25/Instructions!$C$29)*100","v":0},{"$f":"(R25/Instructions!$C$30)*100","v":0},{"$f":"(S25/Instructions!$C$31)*100","v":0},{"$f":"(T25/Instructions!$C$30)*100","v":0},{"$f":"(U25/Instructions!$C$33)*100","v":{"$error":"#VALUE!"}},"----","E","E","E","E","E","E","E","E","E","E","--",null,null,null,null,null,{"$f":"Table_2[[#This Row],[Column51]]&Table_2[[#This Row],[Column52]]&AW27","v":""}]
[25,null,null,null,null,null,null,null,null,null,null,null,null,null,null,null,null,null,null,null,"--",0,null,null,{"$f":"(K26/Instructions!$C$23)*100","v":0},{"$f":"(L26/Instructions!$C$24)*100","v":0},{"$f":"(M26/Instructions!$C$25)*100","v":0},{"$f":"(N26/Instructions!$C$26)*100","v":0},{"$f":"(O26/Instructions!$C$27)*100","v":0},{"$f":"(P26/Instructions!$C$28)*100","v":0},{"$f":"(Q26/Instructions!$C$29)*100","v":0},{"$f":"(R26/Instructions!$C$30)*100","v":0},{"$f":"(S26/Instructions!$C$31)*100","v":0},{"$f":"(T26/Instructions!$C$30)*100","v":0},{"$f":"(U26/Instructions!$C$33)*100","v":{"$error":"#VALUE!"}},"----","E","E","E","E","E","E","E","E","E","E","--",null,null,null,null,null,{"$f":"Table_2[[#This Row],[Column51]]&Table_2[[#This Row],[Column52]]&AW28","v":""}]
[26,null,null,null,null,null,null,null,null,null,null,null,null,null,null,null,null,null,null,null,"--",0,null,null,{"$f":"(K27/Instructions!$C$23)*100","v":0},{"$f":"(L27/Instructions!$C$24)*100","v":0},{"$f":"(M27/Instructions!$C$25)*100","v":0},{"$f":"(N27/Instructions!$C$26)*100","v":0},{"$f":"(O27/Instructions!$C$27)*100","v":0},{"$f":"(P27/Instructions!$C$28)*100","v":0},{"$f":"(Q27/Instructions!$C$29)*100","v":0},{"$f":"(R27/Instructions!$C$30)*100","v":0},{"$f":"(S27/Instructions!$C$31)*100","v":0},{"$f":"(T27/Instructions!$C$30)*100","v":0},{"$f":"(U27/Instructions!$C$33)*100","v":{"$error":"#VALUE!"}},"----","E","E","E","E","E","E","E","E","E","E","--",null,null,null,null,null,{"$f":"Table_2[[#This Row],[Column51]]&Table_2[[#This Row],[Column52]]&AW29","v":""}]
[27,null,null,null,null,null,null,null,null,null,null,null,null,null,null,null,null,null,null,null,"--",0,null,null,{"$f":"(K28/Instructions!$C$23)*100","v":0},{"$f":"(L28/Instructions!$C$24)*100","v":0},{"$f":"(M28/Instructions!$C$25)*100","v":0},{"$f":"(N28/Instructions!$C$26)*100","v":0},{"$f":"(O28/Instructions!$C$27)*100","v":0},{"$f":"(P28/Instructions!$C$28)*100","v":0},{"$f":"(Q28/Instructions!$C$29)*100","v":0},{"$f":"(R28/Instructions!$C$30)*100","v":0},{"$f":"(S28/Instructions!$C$31)*100","v":0},{"$f":"(T28/Instructions!$C$30)*100","v":0},{"$f":"(U28/Instructions!$C$33)*100","v":{"$error":"#VALUE!"}},"----","E","E","E","E","E","E","E","E","E","E","--",null,null,null,null,null,{"$f":"Table_2[[#This Row],[Column51]]&Table_2[[#This Row],[Column52]]&AW30","v":""}]
[28,null,null,null,null,null,null,null,null,null,null,null,null,null,null,null,null,null,null,null,"--",0,null,null,{"$f":"(K29/Instructions!$C$23)*100","v":0},{"$f":"(L29/Instructions!$C$24)*100","v":0},{"$f":"(M29/Instructions!$C$25)*100","v":0},{"$f":"(N29/Instructions!$C$26)*100","v":0},{"$f":"(O29/Instructions!$C$27)*100","v":0},{"$f":"(P29/Instructions!$C$28)*100","v":0},{"$f":"(Q29/Instructions!$C$29)*100","v":0},{"$f":"(R29/Instructions!$C$30)*100","v":0},{"$f":"(S29/Instructions!$C$31)*100","v":0},{"$f":"(T29/Instructions!$C$30)*100","v":0},{"$f":"(U29/Instructions!$C$33)*100","v":{"$error":"#VALUE!"}},"----","E","E","E","E","E","E","E","E","E","E","--",null,null,null,null,null,{"$f":"Table_2[[#This Row],[Column51]]&Table_2[[#This Row],[Column52]]&AW31","v":""}]
[29,null,null,null,null,null,null,null,null,null,null,null,null,null,null,null,null,null,null,null,"--",0,null,null,{"$f":"(K30/Instructions!$C$23)*100","v":0},{"$f":"(L30/Instructions!$C$24)*100","v":0},{"$f":"(M30/Instructions!$C$25)*100","v":0},{"$f":"(N30/Instructions!$C$26)*100","v":0},{"$f":"(O30/Instructions!$C$27)*100","v":0},{"$f":"(P30/Instructions!$C$28)*100","v":0},{"$f":"(Q30/Instructions!$C$29)*100","v":0},{"$f":"(R30/Instructions!$C$30)*100","v":0},{"$f":"(S30/Instructions!$C$31)*100","v":0},{"$f":"(T30/Instructions!$C$30)*100","v":0},{"$f":"(U30/Instructions!$C$33)*100","v":{"$error":"#VALUE!"}},"----","E","E","E","E","E","E","E","E","E","E","--",null,null,null,null,null,{"$f":"Table_2[[#This Row],[Column51]]&Table_2[[#This Row],[Column52]]&AW32","v":""}]
[30,null,null,null,null,null,null,null,null,null,null,null,null,null,null,null,null,null,null,null,"--",0,null,null,{"$f":"(K31/Instructions!$C$23)*100","v":0},{"$f":"(L31/Instructions!$C$24)*100","v":0},{"$f":"(M31/Instructions!$C$25)*100","v":0},{"$f":"(N31/Instructions!$C$26)*100","v":0},{"$f":"(O31/Instructions!$C$27)*100","v":0},{"$f":"(P31/Instructions!$C$28)*100","v":0},{"$f":"(Q31/Instructions!$C$29)*100","v":0},{"$f":"(R31/Instructions!$C$30)*100","v":0},{"$f":"(S31/Instructions!$C$31)*100","v":0},{"$f":"(T31/Instructions!$C$30)*100","v":0},{"$f":"(U31/Instructions!$C$33)*100","v":{"$error":"#VALUE!"}},"----","E","E","E","E","E","E","E","E","E","E","--",null,null,null,null,null,{"$f":"Table_2[[#This Row],[Column51]]&Table_2[[#This Row],[Column52]]&AW33","v":""}]
[31,null,null,null,null,null,null,null,null,null,null,null,null,null,null,null,null,null,null,null,"--",0,null,null,{"$f":"(K32/Instructions!$C$23)*100","v":0},{"$f":"(L32/Instructions!$C$24)*100","v":0},{"$f":"(M32/Instructions!$C$25)*100","v":0},{"$f":"(N32/Instructions!$C$26)*100","v":0},{"$f":"(O32/Instructions!$C$27)*100","v":0},{"$f":"(P32/Instructions!$C$28)*100","v":0},{"$f":"(Q32/Instructions!$C$29)*100","v":0},{"$f":"(R32/Instructions!$C$30)*100","v":0},{"$f":"(S32/Instructions!$C$31)*100","v":0},{"$f":"(T32/Instructions!$C$30)*100","v":0},{"$f":"(U32/Instructions!$C$33)*100","v":{"$error":"#VALUE!"}},"----","E","E","E","E","E","E","E","E","E","E","--",null,null,null,null,null,{"$f":"Table_2[[#This Row],[Column51]]&Table_2[[#This Row],[Column52]]&AW34","v":""}]
[32,null,null,null,null,null,null,null,null,null,null,null,null,null,null,null,null,null,null,null,"--",0,null,null,{"$f":"(K33/Instructions!$C$23)*100","v":0},{"$f":"(L33/Instructions!$C$24)*100","v":0},{"$f":"(M33/Instructions!$C$25)*100","v":0},{"$f":"(N33/Instructions!$C$26)*100","v":0},{"$f":"(O33/Instructions!$C$27)*100","v":0},{"$f":"(P33/Instructions!$C$28)*100","v":0},{"$f":"(Q33/Instructions!$C$29)*100","v":0},{"$f":"(R33/Instructions!$C$30)*100","v":0},{"$f":"(S33/Instructions!$C$31)*100","v":0},{"$f":"(T33/Instructions!$C$30)*100","v":0},{"$f":"(U33/Instructions!$C$33)*100","v":{"$error":"#VALUE!"}},"----","E","E","E","E","E","E","E","E","E","E","--",null,null,null,null,null,{"$f":"Table_2[[#This Row],[Column51]]&Table_2[[#This Row],[Column52]]&AW35","v":""}]
[33,null,null,null,null,null,null,null,null,null,null,null,null,null,null,null,null,null,null,null,"--",0,null,null,{"$f":"(K34/Instructions!$C$23)*100","v":0},{"$f":"(L34/Instructions!$C$24)*100","v":0},{"$f":"(M34/Instructions!$C$25)*100","v":0},{"$f":"(N34/Instructions!$C$26)*100","v":0},{"$f":"(O34/Instructions!$C$27)*100","v":0},{"$f":"(P34/Instructions!$C$28)*100","v":0},{"$f":"(Q34/Instructions!$C$29)*100","v":0},{"$f":"(R34/Instructions!$C$30)*100","v":0},{"$f":"(S34/Instructions!$C$31)*100","v":0},{"$f":"(T34/Instructions!$C$30)*100","v":0},{"$f":"(U34/Instructions!$C$33)*100","v":{"$error":"#VALUE!"}},"----",{"$f":"IFERROR(IF(Y34>90,\"A+\",IF(Y34>80,\"A\",IF(Y34>70,\"B+\",IF(Y34>60,\"B\",IF(Y34>50,\"C+\",IF(Y34>40,\"C\",IF(Y34>=33,\"D\",\"E\"))))))),\"Abs\")","v":"E"},"E","E","E","E","E","E","E","E","E","--",null,null,null,null,null,{"$f":"Table_2[[#This Row],[Column51]]&Table_2[[#This Row],[Column52]]&AW36","v":""}]
[34,null,null,null,null,null,null,null,null,null,null,null,null,null,null,null,null,null,null,null,"--",0,null,null,{"$f":"(K35/Instructions!$C$23)*100","v":0},{"$f":"(L35/Instructions!$C$24)*100","v":0},{"$f":"(M35/Instructions!$C$25)*100","v":0},{"$f":"(N35/Instructions!$C$26)*100","v":0},{"$f":"(O35/Instructions!$C$27)*100","v":0},{"$f":"(P35/Instructions!$C$28)*100","v":0},{"$f":"(Q35/Instructions!$C$29)*100","v":0},{"$f":"(R35/Instructions!$C$30)*100","v":0},{"$f":"(S35/Instructions!$C$31)*100","v":0},{"$f":"(T35/Instructions!$C$30)*100","v":0},{"$f":"(U35/Instructions!$C$33)*100","v":{"$error":"#VALUE!"}},"----","E","E","E","E","E","E","E","E","E","E","--",null,null,null,null,null,{"$f":"Table_2[[#This Row],[Column51]]&Table_2[[#This Row],[Column52]]&AW37","v":""}]
[35,null,null,null,null,null,null,null,null,null,null,null,null,null,null,null,null,null,null,null,"--",0,null,null,{"$f":"(K36/Instructions!$C$23)*100","v":0},{"$f":"(L36/Instructions!$C$24)*100","v":0},{"$f":"(M36/Instructions!$C$25)*100","v":0},{"$f":"(N36/Instructions!$C$26)*100","v":0},{"$f":"(O36/Instructions!$C$27)*100","v":0},{"$f":"(P36/Instructions!$C$28)*100","v":0},{"$f":"(Q36/Instructions!$C$29)*100","v":0},{"$f":"(R36/Instructions!$C$30)*100","v":0},{"$f":"(S36/Instructions!$C$31)*100","v":0},{"$f":"(T36/Instructions!$C$30)*100","v":0},{"$f":"(U36/Instructions!$C$33)*100","v":{"$error":"#VALUE!"}},"----","E","E","E","E","E","E","E","E","E","E","--",null,null,null,null,null,{"$f":"Table_2[[#This Row],[Column51]]&Table_2[[#This Row],[Column52]]&AW38","v":""}]
[36,null,null,null,null,null,null,null,null,null,null,null,null,null,null,null,null,null,null,null,"--",0,null,null,{"$f":"(K37/Instructions!$C$23)*100","v":0},{"$f":"(L37/Instructions!$C$24)*100","v":0},{"$f":"(M37/Instructions!$C$25)*100","v":0},{"$f":"(N37/Instructions!$C$26)*100","v":0},{"$f":"(O37/Instructions!$C$27)*100","v":0},{"$f":"(P37/Instructions!$C$28)*100","v":0},{"$f":"(Q37/Instructions!$C$29)*100","v":0},{"$f":"(R37/Instructions!$C$30)*100","v":0},{"$f":"(S37/Instructions!$C$31)*100","v":0},{"$f":"(T37/Instructions!$C$30)*100","v":0},{"$f":"(U37/Instructions!$C$33)*100","v":{"$error":"#VALUE!"}},"----","E","E","E","E","E","E","E","E","E","E","--",null,null,null,null,null,{"$f":"Table_2[[#This Row],[Column51]]&Table_2[[#This Row],[Column52]]&AW39","v":""}]
[37,null,null,null,null,null,null,null,null,null,null,null,null,null,null,null,null,null,null,null,"--",0,null,null,{"$f":"(K38/Instructions!$C$23)*100","v":0},{"$f":"(L38/Instructions!$C$24)*100","v":0},{"$f":"(M38/Instructions!$C$25)*100","v":0},{"$f":"(N38/Instructions!$C$26)*100","v":0},{"$f":"(O38/Instructions!$C$27)*100","v":0},{"$f":"(P38/Instructions!$C$28)*100","v":0},{"$f":"(Q38/Instructions!$C$29)*100","v":0},{"$f":"(R38/Instructions!$C$30)*100","v":0},{"$f":"(S38/Instructions!$C$31)*100","v":0},{"$f":"(T38/Instructions!$C$30)*100","v":0},{"$f":"(U38/Instructions!$C$33)*100","v":{"$error":"#VALUE!"}},"----","E","E","E","E","E","E","E","E","E","E","--",null,null,null,null,null,{"$f":"Table_2[[#This Row],[Column51]]&Table_2[[#This Row],[Column52]]&AW40","v":""}]
[38,null,null,null,null,null,null,null,null,null,null,null,null,null,null,null,null,null,null,null,"--",0,null,null,{"$f":"(K39/Instructions!$C$23)*100","v":0},{"$f":"(L39/Instructions!$C$24)*100","v":0},{"$f":"(M39/Instructions!$C$25)*100","v":0},{"$f":"(N39/Instructions!$C$26)*100","v":0},{"$f":"(O39/Instructions!$C$27)*100","v":0},{"$f":"(P39/Instructions!$C$28)*100","v":0},{"$f":"(Q39/Instructions!$C$29)*100","v":0},{"$f":"(R39/Instructions!$C$30)*100","v":0},{"$f":"(S39/Instructions!$C$31)*100","v":0},{"$f":"(T39/Instructions!$C$30)*100","v":0},{"$f":"(U39/Instructions!$C$33)*100","v":{"$error":"#VALUE!"}},"----","E","E","E","E","E","E","E","E","E","E","--",null,null,null,null,null,{"$f":"Table_2[[#This Row],[Column51]]&Table_2[[#This Row],[Column52]]&AW41","v":""}]
[39,null,null,null,null,null,null,null,null,null,null,null,null,null,null,null,null,null,null,null,"--",0,null,null,{"$f":"(K40/Instructions!$C$23)*100","v":0},{"$f":"(L40/Instructions!$C$24)*100","v":0},{"$f":"(M40/Instructions!$C$25)*100","v":0},{"$f":"(N40/Instructions!$C$26)*100","v":0},{"$f":"(O40/Instructions!$C$27)*100","v":0},{"$f":"(P40/Instructions!$C$28)*100","v":0},{"$f":"(Q40/Instructions!$C$29)*100","v":0},{"$f":"(R40/Instructions!$C$30)*100","v":0},{"$f":"(S40/Instructions!$C$31)*100","v":0},{"$f":"(T40/Instructions!$C$30)*100","v":0},{"$f":"(U40/Instructions!$C$33)*100","v":{"$error":"#VALUE!"}},"----","E","E","E","E","E","E","E","E","E","E","--",null,null,null,null,null,{"$f":"Table_2[[#This Row],[Column51]]&Table_2[[#This Row],[Column52]]&AW42","v":""}]
[40,null,null,null,null,null,null,null,null,null,null,null,null,null,null,null,null,null,null,null,"--",0,null,null,{"$f":"(K41/Instructions!$C$23)*100","v":0},{"$f":"(L41/Instructions!$C$24)*100","v":0},{"$f":"(M41/Instructions!$C$25)*100","v":0},{"$f":"(N41/Instructions!$C$26)*100","v":0},{"$f":"(O41/Instructions!$C$27)*100","v":0},{"$f":"(P41/Instructions!$C$28)*100","v":0},{"$f":"(Q41/Instructions!$C$29)*100","v":0},{"$f":"(R41/Instructions!$C$30)*100","v":0},{"$f":"(S41/Instructions!$C$31)*100","v":0},{"$f":"(T41/Instructions!$C$30)*100","v":0},{"$f":"(U41/Instructions!$C$33)*100","v":{"$error":"#VALUE!"}},"----","E","E","E","E","E","E","E","E","E","E","--",null,null,null,null,null,{"$f":"Table_2[[#This Row],[Column51]]&Table_2[[#This Row],[Column52]]&AW43","v":""}]
[41,null,null,null,null,null,null,null,null,null,null,null,null,null,null,null,null,null,null,null,"--",0,null,null,{"$f":"(K42/Instructions!$C$23)*100","v":0},{"$f":"(L42/Instructions!$C$24)*100","v":0},{"$f":"(M42/Instructions!$C$25)*100","v":0},{"$f":"(N42/Instructions!$C$26)*100","v":0},{"$f":"(O42/Instructions!$C$27)*100","v":0},{"$f":"(P42/Instructions!$C$28)*100","v":0},{"$f":"(Q42/Instructions!$C$29)*100","v":0},{"$f":"(R42/Instructions!$C$30)*100","v":0},{"$f":"(S42/Instructions!$C$31)*100","v":0},{"$f":"(T42/Instructions!$C$30)*100","v":0},{"$f":"(U42/Instructions!$C$33)*100","v":{"$error":"#VALUE!"}},"----","E","E","E","E","E","E","E","E","E","E","--",null,null,null,null,null,{"$f":"Table_2[[#This Row],[Column51]]&Table_2[[#This Row],[Column52]]&AW44","v":""}]
[42,null,null,null,null,null,null,null,null,null,null,null,null,null,null,null,null,null,null,null,"--",0,null,null,{"$f":"(K43/Instructions!$C$23)*100","v":0},{"$f":"(L43/Instructions!$C$24)*100","v":0},{"$f":"(M43/Instructions!$C$25)*100","v":0},{"$f":"(N43/Instructions!$C$26)*100","v":0},{"$f":"(O43/Instructions!$C$27)*100","v":0},{"$f":"(P43/Instructions!$C$28)*100","v":0},{"$f":"(Q43/Instructions!$C$29)*100","v":0},{"$f":"(R43/Instructions!$C$30)*100","v":0},{"$f":"(S43/Instructions!$C$31)*100","v":0},{"$f":"(T43/Instructions!$C$30)*100","v":0},{"$f":"(U43/Instructions!$C$33)*100","v":{"$error":"#VALUE!"}},"----","E","E","E","E","E","E","E","E","E","E","--",null,null,null,null,null,{"$f":"Table_2[[#This Row],[Column51]]&Table_2[[#This Row],[Column52]]&AW45","v":""}]
[43,null,null,null,null,null,null,null,null,null,null,null,null,null,null,null,null,null,null,null,"--",0,null,null,{"$f":"(K44/Instructions!$C$23)*100","v":0},{"$f":"(L44/Instructions!$C$24)*100","v":0},{"$f":"(M44/Instructions!$C$25)*100","v":0},{"$f":"(N44/Instructions!$C$26)*100","v":0},{"$f":"(O44/Instructions!$C$27)*100","v":0},{"$f":"(P44/Instructions!$C$28)*100","v":0},{"$f":"(Q44/Instructions!$C$29)*100","v":0},{"$f":"(R44/Instructions!$C$30)*100","v":0},{"$f":"(S44/Instructions!$C$31)*100","v":0},{"$f":"(T44/Instructions!$C$30)*100","v":0},{"$f":"(U44/Instructions!$C$33)*100","v":{"$error":"#VALUE!"}},"----","E","E","E","E","E","E","E","E","E","E","--",null,null,null,null,null,{"$f":"Table_2[[#This Row],[Column51]]&Table_2[[#This Row],[Column52]]&AW46","v":""}]
[44,null,null,null,null,null,null,null,null,null,null,null,null,null,null,null,null,null,null,null,"--",0,null,null,{"$f":"(K45/Instructions!$C$23)*100","v":0},{"$f":"(L45/Instructions!$C$24)*100","v":0},{"$f":"(M45/Instructions!$C$25)*100","v":0},{"$f":"(N45/Instructions!$C$26)*100","v":0},{"$f":"(O45/Instructions!$C$27)*100","v":0},{"$f":"(P45/Instructions!$C$28)*100","v":0},{"$f":"(Q45/Instructions!$C$29)*100","v":0},{"$f":"(R45/Instructions!$C$30)*100","v":0},{"$f":"(S45/Instructions!$C$31)*100","v":0},{"$f":"(T45/Instructions!$C$30)*100","v":0},{"$f":"(U45/Instructions!$C$33)*100","v":{"$error":"#VALUE!"}},"----","E","E","E","E","E","E","E","E","E","E","--",null,null,null,null,null,{"$f":"Table_2[[#This Row],[Column51]]&Table_2[[#This Row],[Column52]]&AW47","v":""}]
[45,null,null,null,null,null,null,null,null,null,null,null,null,null,null,null,null,null,null,null,"--",0,null,null,{"$f":"(K46/Instructions!$C$23)*100","v":0},{"$f":"(L46/Instructions!$C$24)*100","v":0},{"$f":"(M46/Instructions!$C$25)*100","v":0},{"$f":"(N46/Instructions!$C$26)*100","v":0},{"$f":"(O46/Instructions!$C$27)*100","v":0},{"$f":"(P46/Instructions!$C$28)*100","v":0},{"$f":"(Q46/Instructions!$C$29)*100","v":0},{"$f":"(R46/Instructions!$C$30)*100","v":0},{"$f":"(S46/Instructions!$C$31)*100","v":0},{"$f":"(T46/Instructions!$C$30)*100","v":0},{"$f":"(U46/Instructions!$C$33)*100","v":{"$error":"#VALUE!"}},"----","E","E","E","E","E","E","E","E","E","E","--",null,null,null,null,null,{"$f":"Table_2[[#This Row],[Column51]]&Table_2[[#This Row],[Column52]]&AW48","v":""}]
[46,null,null,null,null,null,null,null,null,null,null,null,null,null,null,null,null,null,null,null,"--",0,null,null,{"$f":"(K47/Instructions!$C$23)*100","v":0},{"$f":"(L47/Instructions!$C$24)*100","v":0},{"$f":"(M47/Instructions!$C$25)*100","v":0},{"$f":"(N47/Instructions!$C$26)*100","v":0},{"$f":"(O47/Instructions!$C$27)*100","v":0},{"$f":"(P47/Instructions!$C$28)*100","v":0},{"$f":"(Q47/Instructions!$C$29)*100","v":0},{"$f":"(R47/Instructions!$C$30)*100","v":0},{"$f":"(S47/Instructions!$C$31)*100","v":0},{"$f":"(T47/Instructions!$C$30)*100","v":0},{"$f":"(U47/Instructions!$C$33)*100","v":{"$error":"#VALUE!"}},"----","E","E","E","E","E","E","E","E","E","E","--",null,null,null,null,null,{"$f":"Table_2[[#This Row],[Column51]]&Table_2[[#This Row],[Column52]]&AW49","v":""}]
[47,null,null,null,null,null,null,null,null,null,null,null,null,null,null,null,null,null,null,null,"--",0,null,null,{"$f":"(K48/Instructions!$C$23)*100","v":0},{"$f":"(L48/Instructions!$C$24)*100","v":0},{"$f":"(M48/Instructions!$C$25)*100","v":0},{"$f":"(N48/Instructions!$C$26)*100","v":0},{"$f":"(O48/Instructions!$C$27)*100","v":0},{"$f":"(P48/Instructions!$C$28)*100","v":0},{"$f":"(Q48/Instructions!$C$29)*100","v":0},{"$f":"(R48/Instructions!$C$30)*100","v":0},{"$f":"(S48/Instructions!$C$31)*100","v":0},{"$f":"(T48/Instructions!$C$30)*100","v":0},{"$f":"(U48/Instructions!$C$33)*100","v":{"$error":"#VALUE!"}},"----","E","E","E","E","E","E","E","E","E","E","--",null,null,null,null,null,{"$f":"Table_2[[#This Row],[Column51]]&Table_2[[#This Row],[Column52]]&AW50","v":""}]
[48,null,null,null,null,null,null,null,null,null,null,null,null,null,null,null,null,null,null,null,"--",0,null,null,{"$f":"(K49/Instructions!$C$23)*100","v":0},{"$f":"(L49/Instructions!$C$24)*100","v":0},{"$f":"(M49/Instructions!$C$25)*100","v":0},{"$f":"(N49/Instructions!$C$26)*100","v":0},{"$f":"(O49/Instructions!$C$27)*100","v":0},{"$f":"(P49/Instructions!$C$28)*100","v":0},{"$f":"(Q49/Instructions!$C$29)*100","v":0},{"$f":"(R49/Instructions!$C$30)*100","v":0},{"$f":"(S49/Instructions!$C$31)*100","v":0},{"$f":"(T49/Instructions!$C$30)*100","v":0},{"$f":"(U49/Instructions!$C$33)*100","v":{"$error":"#VALUE!"}},"----","E","E","E","E","E","E","E","E","E","E","--",null,null,null,null,null,{"$f":"Table_2[[#This Row],[Column51]]&Table_2[[#This Row],[Column52]]&AW51","v":""}]
[49,null,null,null,null,null,null,null,null,null,null,null,null,null,null,null,null,null,null,null,"--",0,null,null,{"$f":"(K50/Instructions!$C$23)*100","v":0},{"$f":"(L50/Instructions!$C$24)*100","v":0},{"$f":"(M50/Instructions!$C$25)*100","v":0},{"$f":"(N50/Instructions!$C$26)*100","v":0},{"$f":"(O50/Instructions!$C$27)*100","v":0},{"$f":"(P50/Instructions!$C$28)*100","v":0},{"$f":"(Q50/Instructions!$C$29)*100","v":0},{"$f":"(R50/Instructions!$C$30)*100","v":0},{"$f":"(S50/Instructions!$C$31)*100","v":0},{"$f":"(T50/Instructions!$C$30)*100","v":0},{"$f":"(U50/Instructions!$C$33)*100","v":{"$error":"#VALUE!"}},"----",{"$f":"IFERROR(IF(Y50>90,\"A+\",IF(Y50>80,\"A\",IF(Y50>70,\"B+\",IF(Y50>60,\"B\",IF(Y50>50,\"C+\",IF(Y50>40,\"C\",IF(Y50>=33,\"D\",\"E\"))))))),\"Abs\")","v":"E"},"E","E","E","E","E","E","E","E","E","--",null,null,null,null,null,{"$f":"Table_2[[#This Row],[Column51]]&Table_2[[#This Row],[Column52]]&AW52","v":""}]
[50,null,null,null,null,null,null,null,null,null,null,null,null,null,null,null,null,null,null,null,"--",0,null,null,{"$f":"(K51/Instructions!$C$23)*100","v":0},{"$f":"(L51/Instructions!$C$24)*100","v":0},{"$f":"(M51/Instructions!$C$25)*100","v":0},{"$f":"(N51/Instructions!$C$26)*100","v":0},{"$f":"(O51/Instructions!$C$27)*100","v":0},{"$f":"(P51/Instructions!$C$28)*100","v":0},{"$f":"(Q51/Instructions!$C$29)*100","v":0},{"$f":"(R51/Instructions!$C$30)*100","v":0},{"$f":"(S51/Instructions!$C$31)*100","v":0},{"$f":"(T51/Instructions!$C$30)*100","v":0},{"$f":"(U51/Instructions!$C$33)*100","v":{"$error":"#VALUE!"}},{"$f":"IF(AND(Y51>=33,Z51>=33,AA51>=33,AB51>=33,AC51>=33,AD51>=33),\"PASS\",\"----\")","v":"----"},"E","E","E","E","E","E","E","E","E","E","--",null,null,null,null,null,{"$f":"Table_2[[#This Row],[Column51]]&Table_2[[#This Row],[Column52]]&AW53","v":""}]
[51,null,null,null,null,null,null,null,null,null,null,null,null,null,null,null,null,null,null,null,"--",0,null,null,{"$f":"(K52/Instructions!$C$23)*100","v":0},{"$f":"(L52/Instructions!$C$24)*100","v":0},{"$f":"(M52/Instructions!$C$25)*100","v":0},{"$f":"(N52/Instructions!$C$26)*100","v":0},{"$f":"(O52/Instructions!$C$27)*100","v":0},{"$f":"(P52/Instructions!$C$28)*100","v":0},{"$f":"(Q52/Instructions!$C$29)*100","v":0},{"$f":"(R52/Instructions!$C$30)*100","v":0},{"$f":"(S52/Instructions!$C$31)*100","v":0},{"$f":"(T52/Instructions!$C$30)*100","v":0},{"$f":"(U52/Instructions!$C$33)*100","v":{"$error":"#VALUE!"}},"----",{"$f":"IFERROR(IF(Y52>90,\"A+\",IF(Y52>80,\"A\",IF(Y52>70,\"B+\",IF(Y52>60,\"B\",IF(Y52>50,\"C+\",IF(Y52>40,\"C\",IF(Y52>=33,\"D\",\"E\"))))))),\"Abs\")","v":"E"},{"$f":"IFERROR(IF(Z52>90,\"A+\",IF(Z52>80,\"A\",IF(Z52>70,\"B+\",IF(Z52>60,\"B\",IF(Z52>50,\"C+\",IF(Z52>40,\"C\",IF(Z52>=33,\"D\",\"E\"))))))),\"Abs\")","v":"E"},{"$f":"IFERROR(IF(AA52>90,\"A+\",IF(AA52>80,\"A\",IF(AA52>70,\"B+\",IF(AA52>60,\"B\",IF(AA52>50,\"C+\",IF(AA52>40,\"C\",IF(AA52>=33,\"D\",\"E\"))))))),\"Abs\")","v":"E"},{"$f":"IFERROR(IF(AB52>90,\"A+\",IF(AB52>80,\"A\",IF(AB52>70,\"B+\",IF(AB52>60,\"B\",IF(AB52>50,\"C+\",IF(AB52>40,\"C\",IF(AB52>=33,\"D\",\"E\"))))))),\"Abs\")","v":"E"},{"$f":"IFERROR(IF(AC52>90,\"A+\",IF(AC52>80,\"A\",IF(AC52>70,\"B+\",IF(AC52>60,\"B\",IF(AC52>50,\"C+\",IF(AC52>40,\"C\",IF(AC52>=33,\"D\",\"E\"))))))),\"Abs\")","v":"E"},{"$f":"IFERROR(IF(AD52>90,\"A+\",IF(AD52>80,\"A\",IF(AD52>70,\"B+\",IF(AD52>60,\"B\",IF(AD52>50,\"C+\",IF(AD52>40,\"C\",IF(AD52>=33,\"D\",\"E\"))))))),\"Abs\")","v":"E"},{"$f":"IFERROR(IF(AE52>90,\"A+\",IF(AE52>80,\"A\",IF(AE52>70,\"B+\",IF(AE52>60,\"B\",IF(AE52>50,\"C+\",IF(AE52>40,\"C\",IF(AE52>=33,\"D\",\"E\"))))))),\"Abs\")","v":"E"},{"$f":"IFERROR(IF(AF52>90,\"A+\",IF(AF52>80,\"A\",IF(AF52>70,\"B+\",IF(AF52>60,\"B\",IF(AF52>50,\"C+\",IF(AF52>40,\"C\",IF(AF52>=33,\"D\",\"E\"))))))),\"Abs\")","v":"E"},{"$f":"IFERROR(IF(AG52>90,\"A+\",IF(AG52>80,\"A\",IF(AG52>70,\"B+\",IF(AG52>60,\"B\",IF(AG52>50,\"C+\",IF(AG52>40,\"C\",IF(AG52>=33,\"D\",\"E\"))))))),\"Abs\")","v":"E"},{"$f":"IFERROR(IF(AH52>90,\"A+\",IF(AH52>80,\"A\",IF(AH52>70,\"B+\",IF(AH52>60,\"B\",IF(AH52>50,\"C+\",IF(AH52>40,\"C\",IF(AH52>=33,\"D\",\"E\"))))))),\"Abs\")","v":"E"},"--",null,null,null,null,null,{"$f":"Table_2[[#This Row],[Column51]]&Table_2[[#This Row],[Column52]]&AW54","v":""}]
[52,null,null,null,null,null,null,null,null,null,null,null,null,null,null,null,null,null,null,null,"--",0,null,null,{"$f":"(K53/Instructions!$C$23)*100","v":0},{"$f":"(L53/Instructions!$C$24)*100","v":0},{"$f":"(M53/Instructions!$C$25)*100","v":0},{"$f":"(N53/Instructions!$C$26)*100","v":0},{"$f":"(O53/Instructions!$C$27)*100","v":0},{"$f":"(P53/Instructions!$C$28)*100","v":0},{"$f":"(Q53/Instructions!$C$29)*100","v":0},{"$f":"(R53/Instructions!$C$30)*100","v":0},{"$f":"(S53/Instructions!$C$31)*100","v":0},{"$f":"(T53/Instructions!$C$30)*100","v":0},{"$f":"(U53/Instructions!$C$33)*100","v":{"$error":"#VALUE!"}},"----","E","E","E","E","E","E","E","E","E","E","--",null,null,null,null,null,{"$f":"Table_2[[#This Row],[Column51]]&Table_2[[#This Row],[Column52]]&AW55","v":""}]
[53,null,null,null,null,null,null,null,null,null,null,null,null,null,null,null,null,null,null,null,"--",0,null,null,{"$f":"(K54/Instructions!$C$23)*100","v":0},{"$f":"(L54/Instructions!$C$24)*100","v":0},{"$f":"(M54/Instructions!$C$25)*100","v":0},{"$f":"(N54/Instructions!$C$26)*100","v":0},{"$f":"(O54/Instructions!$C$27)*100","v":0},{"$f":"(P54/Instructions!$C$28)*100","v":0},{"$f":"(Q54/Instructions!$C$29)*100","v":0},{"$f":"(R54/Instructions!$C$30)*100","v":0},{"$f":"(S54/Instructions!$C$31)*100","v":0},{"$f":"(T54/Instructions!$C$30)*100","v":0},{"$f":"(U54/Instructions!$C$33)*100","v":{"$error":"#VALUE!"}},"----","E","E","E","E","E","E","E","E","E","E","--",null,null,null,null,null,{"$f":"Table_2[[#This Row],[Column51]]&Table_2[[#This Row],[Column52]]&AW56","v":""}]
[54,null,null,null,null,null,null,null,null,null,null,null,null,null,null,null,null,null,null,null,"--",0,null,null,{"$f":"(K55/Instructions!$C$23)*100","v":0},{"$f":"(L55/Instructions!$C$24)*100","v":0},{"$f":"(M55/Instructions!$C$25)*100","v":0},{"$f":"(N55/Instructions!$C$26)*100","v":0},{"$f":"(O55/Instructions!$C$27)*100","v":0},{"$f":"(P55/Instructions!$C$28)*100","v":0},{"$f":"(Q55/Instructions!$C$29)*100","v":0},{"$f":"(R55/Instructions!$C$30)*100","v":0},{"$f":"(S55/Instructions!$C$31)*100","v":0},{"$f":"(T55/Instructions!$C$30)*100","v":0},{"$f":"(U55/Instructions!$C$33)*100","v":{"$error":"#VALUE!"}},"----","E","E","E","E","E","E","E","E","E","E","--",null,null,null,null,null,{"$f":"Table_2[[#This Row],[Column51]]&Table_2[[#This Row],[Column52]]&AW57","v":""}]
[55,null,null,null,null,null,null,null,null,null,null,null,null,null,null,null,null,null,null,null,"--",0,null,null,{"$f":"(K56/Instructions!$C$23)*100","v":0},{"$f":"(L56/Instructions!$C$24)*100","v":0},{"$f":"(M56/Instructions!$C$25)*100","v":0},{"$f":"(N56/Instructions!$C$26)*100","v":0},{"$f":"(O56/Instructions!$C$27)*100","v":0},{"$f":"(P56/Instructions!$C$28)*100","v":0},{"$f":"(Q56/Instructions!$C$29)*100","v":0},{"$f":"(R56/Instructions!$C$30)*100","v":0},{"$f":"(S56/Instructions!$C$31)*100","v":0},{"$f":"(T56/Instructions!$C$30)*100","v":0},{"$f":"(U56/Instructions!$C$33)*100","v":{"$error":"#VALUE!"}},"----","E","E","E","E","E","E","E","E","E","E","--",null,null,null,null,null,{"$f":"Table_2[[#This Row],[Column51]]&Table_2[[#This Row],[Column52]]&AW58","v":""}]
[56,null,null,null,null,null,null,null,null,null,null,null,null,null,null,null,null,null,null,null,"--",0,null,null,{"$f":"(K57/Instructions!$C$23)*100","v":0},{"$f":"(L57/Instructions!$C$24)*100","v":0},{"$f":"(M57/Instructions!$C$25)*100","v":0},{"$f":"(N57/Instructions!$C$26)*100","v":0},{"$f":"(O57/Instructions!$C$27)*100","v":0},{"$f":"(P57/Instructions!$C$28)*100","v":0},{"$f":"(Q57/Instructions!$C$29)*100","v":0},{"$f":"(R57/Instructions!$C$30)*100","v":0},{"$f":"(S57/Instructions!$C$31)*100","v":0},{"$f":"(T57/Instructions!$C$30)*100","v":0},{"$f":"(U57/Instructions!$C$33)*100","v":{"$error":"#VALUE!"}},"----","E","E","E","E","E","E","E","E","E","E","--",null,null,null,null,null,{"$f":"Table_2[[#This Row],[Column51]]&Table_2[[#This Row],[Column52]]&AW59","v":""}]
[57,null,null,null,null,null,null,null,null,null,null,null,null,null,null,null,null,null,null,null,"--",0,null,null,{"$f":"(K58/Instructions!$C$23)*100","v":0},{"$f":"(L58/Instructions!$C$24)*100","v":0},{"$f":"(M58/Instructions!$C$25)*100","v":0},{"$f":"(N58/Instructions!$C$26)*100","v":0},{"$f":"(O58/Instructions!$C$27)*100","v":0},{"$f":"(P58/Instructions!$C$28)*100","v":0},{"$f":"(Q58/Instructions!$C$29)*100","v":0},{"$f":"(R58/Instructions!$C$30)*100","v":0},{"$f":"(S58/Instructions!$C$31)*100","v":0},{"$f":"(T58/Instructions!$C$30)*100","v":0},{"$f":"(U58/Instructions!$C$33)*100","v":{"$error":"#VALUE!"}},"----","E","E","E","E","E","E","E","E","E","E","--",null,null,null,null,null,{"$f":"Table_2[[#This Row],[Column51]]&Table_2[[#This Row],[Column52]]&AW60","v":""}]
[58,null,null,null,null,null,null,null,null,null,null,null,null,null,null,null,null,null,null,null,"--",0,null,null,{"$f":"(K59/Instructions!$C$23)*100","v":0},{"$f":"(L59/Instructions!$C$24)*100","v":0},{"$f":"(M59/Instructions!$C$25)*100","v":0},{"$f":"(N59/Instructions!$C$26)*100","v":0},{"$f":"(O59/Instructions!$C$27)*100","v":0},{"$f":"(P59/Instructions!$C$28)*100","v":0},{"$f":"(Q59/Instructions!$C$29)*100","v":0},{"$f":"(R59/Instructions!$C$30)*100","v":0},{"$f":"(S59/Instructions!$C$31)*100","v":0},{"$f":"(T59/Instructions!$C$30)*100","v":0},{"$f":"(U59/Instructions!$C$33)*100","v":{"$error":"#VALUE!"}},"----","E","E","E","E","E","E","E","E","E","E","--",null,null,null,null,null,{"$f":"Table_2[[#This Row],[Column51]]&Table_2[[#This Row],[Column52]]&AW61","v":""}]
[59,null,null,null,null,null,null,null,null,null,null,null,null,null,null,null,null,null,null,null,"--",0,null,null,{"$f":"(K60/Instructions!$C$23)*100","v":0},{"$f":"(L60/Instructions!$C$24)*100","v":0},{"$f":"(M60/Instructions!$C$25)*100","v":0},{"$f":"(N60/Instructions!$C$26)*100","v":0},{"$f":"(O60/Instructions!$C$27)*100","v":0},{"$f":"(P60/Instructions!$C$28)*100","v":0},{"$f":"(Q60/Instructions!$C$29)*100","v":0},{"$f":"(R60/Instructions!$C$30)*100","v":0},{"$f":"(S60/Instructions!$C$31)*100","v":0},{"$f":"(T60/Instructions!$C$30)*100","v":0},{"$f":"(U60/Instructions!$C$33)*100","v":{"$error":"#VALUE!"}},"----","E","E","E","E","E","E","E","E","E","E","--",null,null,null,null,null,{"$f":"Table_2[[#This Row],[Column51]]&Table_2[[#This Row],[Column52]]&AW62","v":""}]
[60,null,null,null,null,null,null,null,null,null,null,null,null,null,null,null,null,null,null,null,"--",0,null,null,{"$f":"(K61/Instructions!$C$23)*100","v":0},{"$f":"(L61/Instructions!$C$24)*100","v":0},{"$f":"(M61/Instructions!$C$25)*100","v":0},{"$f":"(N61/Instructions!$C$26)*100","v":0},{"$f":"(O61/Instructions!$C$27)*100","v":0},{"$f":"(P61/Instructions!$C$28)*100","v":0},{"$f":"(Q61/Instructions!$C$29)*100","v":0},{"$f":"(R61/Instructions!$C$30)*100","v":0},{"$f":"(S61/Instructions!$C$31)*100","v":0},{"$f":"(T61/Instructions!$C$30)*100","v":0},{"$f":"(U61/Instructions!$C$33)*100","v":{"$error":"#VALUE!"}},"----","E","E","E","E","E","E","E","E","E","E","--",null,null,null,null,null,{"$f":"Table_2[[#This Row],[Column51]]&Table_2[[#This Row],[Column52]]&AW63","v":""}]
[61,null,null,null,null,null,null,null,null,null,null,null,null,null,null,null,null,null,null,null,"--",0,null,null,{"$f":"(K62/Instructions!$C$23)*100","v":0},{"$f":"(L62/Instructions!$C$24)*100","v":0},{"$f":"(M62/Instructions!$C$25)*100","v":0},{"$f":"(N62/Instructions!$C$26)*100","v":0},{"$f":"(O62/Instructions!$C$27)*100","v":0},{"$f":"(P62/Instructions!$C$28)*100","v":0},{"$f":"(Q62/Instructions!$C$29)*100","v":0},{"$f":"(R62/Instructions!$C$30)*100","v":0},{"$f":"(S62/Instructions!$C$31)*100","v":0},{"$f":"(T62/Instructions!$C$30)*100","v":0},{"$f":"(U62/Instructions!$C$33)*100","v":{"$error":"#VALUE!"}},"----","E","E","E","E","E","E","E","E","E","E","--",null,null,null,null,null,{"$f":"Table_2[[#This Row],[Column51]]&Table_2[[#This Row],[Column52]]&AW64","v":""}]
[62,null,null,null,null,null,null,null,null,null,null,null,null,null,null,null,null,null,null,null,"--",0,null,null,{"$f":"(K63/Instructions!$C$23)*100","v":0},{"$f":"(L63/Instructions!$C$24)*100","v":0},{"$f":"(M63/Instructions!$C$25)*100","v":0},{"$f":"(N63/Instructions!$C$26)*100","v":0},{"$f":"(O63/Instructions!$C$27)*100","v":0},{"$f":"(P63/Instructions!$C$28)*100","v":0},{"$f":"(Q63/Instructions!$C$29)*100","v":0},{"$f":"(R63/Instructions!$C$30)*100","v":0},{"$f":"(S63/Instructions!$C$31)*100","v":0},{"$f":"(T63/Instructions!$C$30)*100","v":0},{"$f":"(U63/Instructions!$C$33)*100","v":{"$error":"#VALUE!"}},"----","E","E","E","E","E","E","E","E","E","E","--",null,null,null,null,null,{"$f":"Table_2[[#This Row],[Column51]]&Table_2[[#This Row],[Column52]]&AW65","v":""}]
[63,null,null,null,null,null,null,null,null,null,null,null,null,null,null,null,null,null,null,null,"--",0,null,null,{"$f":"(K64/Instructions!$C$23)*100","v":0},{"$f":"(L64/Instructions!$C$24)*100","v":0},{"$f":"(M64/Instructions!$C$25)*100","v":0},{"$f":"(N64/Instructions!$C$26)*100","v":0},{"$f":"(O64/Instructions!$C$27)*100","v":0},{"$f":"(P64/Instructions!$C$28)*100","v":0},{"$f":"(Q64/Instructions!$C$29)*100","v":0},{"$f":"(R64/Instructions!$C$30)*100","v":0},{"$f":"(S64/Instructions!$C$31)*100","v":0},{"$f":"(T64/Instructions!$C$30)*100","v":0},{"$f":"(U64/Instructions!$C$33)*100","v":{"$error":"#VALUE!"}},"----","E","E","E","E","E","E","E","E","E","E","--",null,null,null,null,null,{"$f":"Table_2[[#This Row],[Column51]]&Table_2[[#This Row],[Column52]]&AW66","v":""}]
[64,null,null,null,null,null,null,null,null,null,null,null,null,null,null,null,null,null,null,null,"--",0,null,null,{"$f":"(K65/Instructions!$C$23)*100","v":0},{"$f":"(L65/Instructions!$C$24)*100","v":0},{"$f":"(M65/Instructions!$C$25)*100","v":0},{"$f":"(N65/Instructions!$C$26)*100","v":0},{"$f":"(O65/Instructions!$C$27)*100","v":0},{"$f":"(P65/Instructions!$C$28)*100","v":0},{"$f":"(Q65/Instructions!$C$29)*100","v":0},{"$f":"(R65/Instructions!$C$30)*100","v":0},{"$f":"(S65/Instructions!$C$31)*100","v":0},{"$f":"(T65/Instructions!$C$30)*100","v":0},{"$f":"(U65/Instructions!$C$33)*100","v":{"$error":"#VALUE!"}},"----","E","E","E","E","E","E","E","E","E","E","--",null,null,null,null,null,{"$f":"Table_2[[#This Row],[Column51]]&Table_2[[#This Row],[Column52]]&AW67","v":""}]
[65,null,null,null,null,null,null,null,null,null,null,null,null,null,null,null,null,null,null,null,"--",0,null,null,{"$f":"(K66/Instructions!$C$23)*100","v":0},{"$f":"(L66/Instructions!$C$24)*100","v":0},{"$f":"(M66/Instructions!$C$25)*100","v":0},{"$f":"(N66/Instructions!$C$26)*100","v":0},{"$f":"(O66/Instructions!$C$27)*100","v":0},{"$f":"(P66/Instructions!$C$28)*100","v":0},{"$f":"(Q66/Instructions!$C$29)*100","v":0},{"$f":"(R66/Instructions!$C$30)*100","v":0},{"$f":"(S66/Instructions!$C$31)*100","v":0},{"$f":"(T66/Instructions!$C$30)*100","v":0},{"$f":"(U66/Instructions!$C$33)*100","v":{"$error":"#VALUE!"}},"----","E","E","E","E","E","E","E","E","E","E","--",null,null,null,null,null,{"$f":"Table_2[[#This Row],[Column51]]&Table_2[[#This Row],[Column52]]&AW68","v":""}]
[66,null,null,null,null,null,null,null,null,null,null,null,null,null,null,null,null,null,null,null,{"$f":"IF(MIN(Y67:AD67)>=33,SUM(K67:P67),\"--\")","v":"--"},{"$f":"IF(U67=\"--\",0,U67)","v":0},null,null,{"$f":"(K67/Instructions!$C$23)*100","v":0},{"$f":"(L67/Instructions!$C$24)*100","v":0},{"$f":"(M67/Instructions!$C$25)*100","v":0},{"$f":"(N67/Instructions!$C$26)*100","v":0},{"$f":"(O67/Instructions!$C$27)*100","v":0},{"$f":"(P67/Instructions!$C$28)*100","v":0},{"$f":"(Q67/Instructions!$C$29)*100","v":0},{"$f":"(R67/Instructions!$C$30)*100","v":0},{"$f":"(S67/Instructions!$C$31)*100","v":0},{"$f":"(T67/Instructions!$C$30)*100","v":0},{"$f":"(U67/Instructions!$C$33)*100","v":{"$error":"#VALUE!"}},"----","E","E","E","E","E","E","E","E","E","E",{"$f":"IFERROR(IF(AI67>90,\"A+\",IF(AI67>80,\"A\",IF(AI67>70,\"B+\",IF(AI67>60,\"B\",IF(AI67>50,\"C+\",IF(AI67>40,\"C\",IF(AI67>=33,\"D\",\"E\"))))))),\"--\")","v":"--"},null,null,null,null,null,{"$f":"Table_2[[#This Row],[Column51]]&Table_2[[#This Row],[Column52]]&AW69","v":""}]
[67,null,null,null,null,null,null,null,null,null,null,null,null,null,null,null,null,null,null,null,"--",0,null,null,{"$f":"(K68/Instructions!$C$23)*100","v":0},{"$f":"(L68/Instructions!$C$24)*100","v":0},{"$f":"(M68/Instructions!$C$25)*100","v":0},{"$f":"(N68/Instructions!$C$26)*100","v":0},{"$f":"(O68/Instructions!$C$27)*100","v":0},{"$f":"(P68/Instructions!$C$28)*100","v":0},{"$f":"(Q68/Instructions!$C$29)*100","v":0},{"$f":"(R68/Instructions!$C$30)*100","v":0},{"$f":"(S68/Instructions!$C$31)*100","v":0},{"$f":"(T68/Instructions!$C$30)*100","v":0},{"$f":"(U68/Instructions!$C$33)*100","v":{"$error":"#VALUE!"}},"----","E","E","E","E","E","E","E","E","E","E","--",null,null,null,null,null,{"$f":"Table_2[[#This Row],[Column51]]&Table_2[[#This Row],[Column52]]&AW70","v":""}]
[68,null,null,null,null,null,null,null,null,null,null,null,null,null,null,null,null,null,null,null,"--",0,null,null,{"$f":"(K69/Instructions!$C$23)*100","v":0},{"$f":"(L69/Instructions!$C$24)*100","v":0},{"$f":"(M69/Instructions!$C$25)*100","v":0},{"$f":"(N69/Instructions!$C$26)*100","v":0},{"$f":"(O69/Instructions!$C$27)*100","v":0},{"$f":"(P69/Instructions!$C$28)*100","v":0},{"$f":"(Q69/Instructions!$C$29)*100","v":0},{"$f":"(R69/Instructions!$C$30)*100","v":0},{"$f":"(S69/Instructions!$C$31)*100","v":0},{"$f":"(T69/Instructions!$C$30)*100","v":0},{"$f":"(U69/Instructions!$C$33)*100","v":{"$error":"#VALUE!"}},"----","E","E","E","E","E","E","E","E","E","E","--",null,null,null,null,null,{"$f":"Table_2[[#This Row],[Column51]]&Table_2[[#This Row],[Column52]]&AW71","v":""}]
[69,null,null,null,null,null,null,null,null,null,null,null,null,null,null,null,null,null,null,null,"--",0,null,null,{"$f":"(K70/Instructions!$C$23)*100","v":0},{"$f":"(L70/Instructions!$C$24)*100","v":0},{"$f":"(M70/Instructions!$C$25)*100","v":0},{"$f":"(N70/Instructions!$C$26)*100","v":0},{"$f":"(O70/Instructions!$C$27)*100","v":0},{"$f":"(P70/Instructions!$C$28)*100","v":0},{"$f":"(Q70/Instructions!$C$29)*100","v":0},{"$f":"(R70/Instructions!$C$30)*100","v":0},{"$f":"(S70/Instructions!$C$31)*100","v":0},{"$f":"(T70/Instructions!$C$30)*100","v":0},{"$f":"(U70/Instructions!$C$33)*100","v":{"$error":"#VALUE!"}},"----","E","E","E","E","E","E","E","E","E","E","--",null,null,null,null,null,{"$f":"Table_2[[#This Row],[Column51]]&Table_2[[#This Row],[Column52]]&AW72","v":""}]
[70,null,null,null,null,null,null,null,null,null,null,null,null,null,null,null,null,null,null,null,"--",0,null,null,{"$f":"(K71/Instructions!$C$23)*100","v":0},{"$f":"(L71/Instructions!$C$24)*100","v":0},{"$f":"(M71/Instructions!$C$25)*100","v":0},{"$f":"(N71/Instructions!$C$26)*100","v":0},{"$f":"(O71/Instructions!$C$27)*100","v":0},{"$f":"(P71/Instructions!$C$28)*100","v":0},{"$f":"(Q71/Instructions!$C$29)*100","v":0},{"$f":"(R71/Instructions!$C$30)*100","v":0},{"$f":"(S71/Instructions!$C$31)*100","v":0},{"$f":"(T71/Instructions!$C$30)*100","v":0},{"$f":"(U71/Instructions!$C$33)*100","v":{"$error":"#VALUE!"}},"----","E","E","E","E","E","E","E","E","E","E","--",null,null,null,null,null,{"$f":"Table_2[[#This Row],[Column51]]&Table_2[[#This Row],[Column52]]&AW73","v":""}]
[71,null,null,null,null,null,null,null,null,null,null,null,null,null,null,null,null,null,null,null,"--",0,null,null,{"$f":"(K72/Instructions!$C$23)*100","v":0},{"$f":"(L72/Instructions!$C$24)*100","v":0},{"$f":"(M72/Instructions!$C$25)*100","v":0},{"$f":"(N72/Instructions!$C$26)*100","v":0},{"$f":"(O72/Instructions!$C$27)*100","v":0},{"$f":"(P72/Instructions!$C$28)*100","v":0},{"$f":"(Q72/Instructions!$C$29)*100","v":0},{"$f":"(R72/Instructions!$C$30)*100","v":0},{"$f":"(S72/Instructions!$C$31)*100","v":0},{"$f":"(T72/Instructions!$C$30)*100","v":0},{"$f":"(U72/Instructions!$C$33)*100","v":{"$error":"#VALUE!"}},"----","E","E","E","E","E","E","E","E","E","E","--",null,null,null,null,null,{"$f":"Table_2[[#This Row],[Column51]]&Table_2[[#This Row],[Column52]]&AW74","v":""}]
[72,null,null,null,null,null,null,null,null,null,null,null,null,null,null,null,null,null,null,null,"--",0,null,null,{"$f":"(K73/Instructions!$C$23)*100","v":0},{"$f":"(L73/Instructions!$C$24)*100","v":0},{"$f":"(M73/Instructions!$C$25)*100","v":0},{"$f":"(N73/Instructions!$C$26)*100","v":0},{"$f":"(O73/Instructions!$C$27)*100","v":0},{"$f":"(P73/Instructions!$C$28)*100","v":0},{"$f":"(Q73/Instructions!$C$29)*100","v":0},{"$f":"(R73/Instructions!$C$30)*100","v":0},{"$f":"(S73/Instructions!$C$31)*100","v":0},{"$f":"(T73/Instructions!$C$30)*100","v":0},{"$f":"(U73/Instructions!$C$33)*100","v":{"$error":"#VALUE!"}},"----","E","E","E","E","E","E","E","E","E","E","--",null,null,null,null,null,{"$f":"Table_2[[#This Row],[Column51]]&Table_2[[#This Row],[Column52]]&AW75","v":""}]
[73,null,null,null,null,null,null,null,null,null,null,null,null,null,null,null,null,null,null,null,"--",0,null,null,{"$f":"(K74/Instructions!$C$23)*100","v":0},{"$f":"(L74/Instructions!$C$24)*100","v":0},{"$f":"(M74/Instructions!$C$25)*100","v":0},{"$f":"(N74/Instructions!$C$26)*100","v":0},{"$f":"(O74/Instructions!$C$27)*100","v":0},{"$f":"(P74/Instructions!$C$28)*100","v":0},{"$f":"(Q74/Instructions!$C$29)*100","v":0},{"$f":"(R74/Instructions!$C$30)*100","v":0},{"$f":"(S74/Instructions!$C$31)*100","v":0},{"$f":"(T74/Instructions!$C$30)*100","v":0},{"$f":"(U74/Instructions!$C$33)*100","v":{"$error":"#VALUE!"}},"----","E","E","E","E","E","E","E","E","E","E","--",null,null,null,null,null,{"$f":"Table_2[[#This Row],[Column51]]&Table_2[[#This Row],[Column52]]&AW76","v":""}]
[74,null,null,null,null,null,null,null,null,null,null,null,null,null,null,null,null,null,null,null,"--",0,null,null,{"$f":"(K75/Instructions!$C$23)*100","v":0},{"$f":"(L75/Instructions!$C$24)*100","v":0},{"$f":"(M75/Instructions!$C$25)*100","v":0},{"$f":"(N75/Instructions!$C$26)*100","v":0},{"$f":"(O75/Instructions!$C$27)*100","v":0},{"$f":"(P75/Instructions!$C$28)*100","v":0},{"$f":"(Q75/Instructions!$C$29)*100","v":0},{"$f":"(R75/Instructions!$C$30)*100","v":0},{"$f":"(S75/Instructions!$C$31)*100","v":0},{"$f":"(T75/Instructions!$C$30)*100","v":0},{"$f":"(U75/Instructions!$C$33)*100","v":{"$error":"#VALUE!"}},"----","E","E","E","E","E","E","E","E","E","E","--",null,null,null,null,null,{"$f":"Table_2[[#This Row],[Column51]]&Table_2[[#This Row],[Column52]]&AW77","v":""}]
[75,null,null,null,null,null,null,null,null,null,null,null,null,null,null,null,null,null,null,null,"--",0,null,null,{"$f":"(K76/Instructions!$C$23)*100","v":0},{"$f":"(L76/Instructions!$C$24)*100","v":0},{"$f":"(M76/Instructions!$C$25)*100","v":0},{"$f":"(N76/Instructions!$C$26)*100","v":0},{"$f":"(O76/Instructions!$C$27)*100","v":0},{"$f":"(P76/Instructions!$C$28)*100","v":0},{"$f":"(Q76/Instructions!$C$29)*100","v":0},{"$f":"(R76/Instructions!$C$30)*100","v":0},{"$f":"(S76/Instructions!$C$31)*100","v":0},{"$f":"(T76/Instructions!$C$30)*100","v":0},{"$f":"(U76/Instructions!$C$33)*100","v":{"$error":"#VALUE!"}},"----","E","E","E","E","E","E","E","E","E","E","--",null,null,null,null,null,{"$f":"Table_2[[#This Row],[Column51]]&Table_2[[#This Row],[Column52]]&AW78","v":""}]
[76,null,null,null,null,null,null,null,null,null,null,null,null,null,null,null,null,null,null,null,"--",0,null,null,{"$f":"(K77/Instructions!$C$23)*100","v":0},{"$f":"(L77/Instructions!$C$24)*100","v":0},{"$f":"(M77/Instructions!$C$25)*100","v":0},{"$f":"(N77/Instructions!$C$26)*100","v":0},{"$f":"(O77/Instructions!$C$27)*100","v":0},{"$f":"(P77/Instructions!$C$28)*100","v":0},{"$f":"(Q77/Instructions!$C$29)*100","v":0},{"$f":"(R77/Instructions!$C$30)*100","v":0},{"$f":"(S77/Instructions!$C$31)*100","v":0},{"$f":"(T77/Instructions!$C$30)*100","v":0},{"$f":"(U77/Instructions!$C$33)*100","v":{"$error":"#VALUE!"}},"----","E","E","E","E","E","E","E","E","E","E","--",null,null,null,null,null,{"$f":"Table_2[[#This Row],[Column51]]&Table_2[[#This Row],[Column52]]&AW79","v":""}]
[77,null,null,null,null,null,null,null,null,null,null,null,null,null,null,null,null,null,null,null,"--",0,null,null,{"$f":"(K78/Instructions!$C$23)*100","v":0},{"$f":"(L78/Instructions!$C$24)*100","v":0},{"$f":"(M78/Instructions!$C$25)*100","v":0},{"$f":"(N78/Instructions!$C$26)*100","v":0},{"$f":"(O78/Instructions!$C$27)*100","v":0},{"$f":"(P78/Instructions!$C$28)*100","v":0},{"$f":"(Q78/Instructions!$C$29)*100","v":0},{"$f":"(R78/Instructions!$C$30)*100","v":0},{"$f":"(S78/Instructions!$C$31)*100","v":0},{"$f":"(T78/Instructions!$C$30)*100","v":0},{"$f":"(U78/Instructions!$C$33)*100","v":{"$error":"#VALUE!"}},"----","E","E","E","E","E","E","E","E","E","E","--",null,null,null,null,null,{"$f":"Table_2[[#This Row],[Column51]]&Table_2[[#This Row],[Column52]]&AW80","v":""}]
[78,null,null,null,null,null,null,null,null,null,null,null,null,null,null,null,null,null,null,null,"--",0,null,null,{"$f":"(K79/Instructions!$C$23)*100","v":0},{"$f":"(L79/Instructions!$C$24)*100","v":0},{"$f":"(M79/Instructions!$C$25)*100","v":0},{"$f":"(N79/Instructions!$C$26)*100","v":0},{"$f":"(O79/Instructions!$C$27)*100","v":0},{"$f":"(P79/Instructions!$C$28)*100","v":0},{"$f":"(Q79/Instructions!$C$29)*100","v":0},{"$f":"(R79/Instructions!$C$30)*100","v":0},{"$f":"(S79/Instructions!$C$31)*100","v":0},{"$f":"(T79/Instructions!$C$30)*100","v":0},{"$f":"(U79/Instructions!$C$33)*100","v":{"$error":"#VALUE!"}},"----","E","E","E","E","E","E","E","E","E","E","--",null,null,null,null,null,{"$f":"Table_2[[#This Row],[Column51]]&Table_2[[#This Row],[Column52]]&AW81","v":""}]
[79,null,null,null,null,null,null,null,null,null,null,null,null,null,null,null,null,null,null,null,"--",0,null,null,{"$f":"(K80/Instructions!$C$23)*100","v":0},{"$f":"(L80/Instructions!$C$24)*100","v":0},{"$f":"(M80/Instructions!$C$25)*100","v":0},{"$f":"(N80/Instructions!$C$26)*100","v":0},{"$f":"(O80/Instructions!$C$27)*100","v":0},{"$f":"(P80/Instructions!$C$28)*100","v":0},{"$f":"(Q80/Instructions!$C$29)*100","v":0},{"$f":"(R80/Instructions!$C$30)*100","v":0},{"$f":"(S80/Instructions!$C$31)*100","v":0},{"$f":"(T80/Instructions!$C$30)*100","v":0},{"$f":"(U80/Instructions!$C$33)*100","v":{"$error":"#VALUE!"}},"----","E","E","E","E","E","E","E","E","E","E","--",null,null,null,null,null,{"$f":"Table_2[[#This Row],[Column51]]&Table_2[[#This Row],[Column52]]&AW82","v":""}]
[80,null,null,null,null,null,null,null,null,null,null,null,null,null,null,null,null,null,null,null,"--",0,null,null,{"$f":"(K81/Instructions!$C$23)*100","v":0},{"$f":"(L81/Instructions!$C$24)*100","v":0},{"$f":"(M81/Instructions!$C$25)*100","v":0},{"$f":"(N81/Instructions!$C$26)*100","v":0},{"$f":"(O81/Instructions!$C$27)*100","v":0},{"$f":"(P81/Instructions!$C$28)*100","v":0},{"$f":"(Q81/Instructions!$C$29)*100","v":0},{"$f":"(R81/Instructions!$C$30)*100","v":0},{"$f":"(S81/Instructions!$C$31)*100","v":0},{"$f":"(T81/Instructions!$C$30)*100","v":0},{"$f":"(U81/Instructions!$C$33)*100","v":{"$error":"#VALUE!"}},"----","E","E","E","E","E","E","E","E","E","E","--",null,null,null,null,null,{"$f":"Table_2[[#This Row],[Column51]]&Table_2[[#This Row],[Column52]]&AW83","v":""}]
[81,null,null,null,null,null,null,null,null,null,null,null,null,null,null,null,null,null,null,null,"--",0,null,null,{"$f":"(K82/Instructions!$C$23)*100","v":0},{"$f":"(L82/Instructions!$C$24)*100","v":0},{"$f":"(M82/Instructions!$C$25)*100","v":0},{"$f":"(N82/Instructions!$C$26)*100","v":0},{"$f":"(O82/Instructions!$C$27)*100","v":0},{"$f":"(P82/Instructions!$C$28)*100","v":0},{"$f":"(Q82/Instructions!$C$29)*100","v":0},{"$f":"(R82/Instructions!$C$30)*100","v":0},{"$f":"(S82/Instructions!$C$31)*100","v":0},{"$f":"(T82/Instructions!$C$30)*100","v":0},{"$f":"(U82/Instructions!$C$33)*100","v":{"$error":"#VALUE!"}},"----","E","E","E","E","E","E","E","E","E","E","--",null,null,null,null,null,{"$f":"Table_2[[#This Row],[Column51]]&Table_2[[#This Row],[Column52]]&AW84","v":""}]
[82,null,null,null,null,null,null,null,null,null,null,null,null,null,null,null,null,null,null,null,"--",0,null,null,{"$f":"(K83/Instructions!$C$23)*100","v":0},{"$f":"(L83/Instructions!$C$24)*100","v":0},{"$f":"(M83/Instructions!$C$25)*100","v":0},{"$f":"(N83/Instructions!$C$26)*100","v":0},{"$f":"(O83/Instructions!$C$27)*100","v":0},{"$f":"(P83/Instructions!$C$28)*100","v":0},{"$f":"(Q83/Instructions!$C$29)*100","v":0},{"$f":"(R83/Instructions!$C$30)*100","v":0},{"$f":"(S83/Instructions!$C$31)*100","v":0},{"$f":"(T83/Instructions!$C$30)*100","v":0},{"$f":"(U83/Instructions!$C$33)*100","v":{"$error":"#VALUE!"}},"----","E","E","E","E","E","E","E","E","E","E","--",null,null,null,null,null,{"$f":"Table_2[[#This Row],[Column51]]&Table_2[[#This Row],[Column52]]&AW85","v":""}]
[83,null,null,null,null,null,null,null,null,null,null,null,null,null,null,null,null,null,null,null,"--",0,null,null,{"$f":"(K84/Instructions!$C$23)*100","v":0},{"$f":"(L84/Instructions!$C$24)*100","v":0},{"$f":"(M84/Instructions!$C$25)*100","v":0},{"$f":"(N84/Instructions!$C$26)*100","v":0},{"$f":"(O84/Instructions!$C$27)*100","v":0},{"$f":"(P84/Instructions!$C$28)*100","v":0},{"$f":"(Q84/Instructions!$C$29)*100","v":0},{"$f":"(R84/Instructions!$C$30)*100","v":0},{"$f":"(S84/Instructions!$C$31)*100","v":0},{"$f":"(T84/Instructions!$C$30)*100","v":0},{"$f":"(U84/Instructions!$C$33)*100","v":{"$error":"#VALUE!"}},"----","E","E","E","E","E","E","E","E","E","E","--",null,null,null,null,null,{"$f":"Table_2[[#This Row],[Column51]]&Table_2[[#This Row],[Column52]]&AW86","v":""}]
[84,null,null,null,null,null,null,null,null,null,null,null,null,null,null,null,null,null,null,null,"--",0,null,null,{"$f":"(K85/Instructions!$C$23)*100","v":0},{"$f":"(L85/Instructions!$C$24)*100","v":0},{"$f":"(M85/Instructions!$C$25)*100","v":0},{"$f":"(N85/Instructions!$C$26)*100","v":0},{"$f":"(O85/Instructions!$C$27)*100","v":0},{"$f":"(P85/Instructions!$C$28)*100","v":0},{"$f":"(Q85/Instructions!$C$29)*100","v":0},{"$f":"(R85/Instructions!$C$30)*100","v":0},{"$f":"(S85/Instructions!$C$31)*100","v":0},{"$f":"(T85/Instructions!$C$30)*100","v":0},{"$f":"(U85/Instructions!$C$33)*100","v":{"$error":"#VALUE!"}},"----","E","E","E","E","E","E","E","E","E","E","--",null,null,null,null,null,{"$f":"Table_2[[#This Row],[Column51]]&Table_2[[#This Row],[Column52]]&AW87","v":""}]
[85,null,null,null,null,null,null,null,null,null,null,null,null,null,null,null,null,null,null,null,"--",0,null,null,{"$f":"(K86/Instructions!$C$23)*100","v":0},{"$f":"(L86/Instructions!$C$24)*100","v":0},{"$f":"(M86/Instructions!$C$25)*100","v":0},{"$f":"(N86/Instructions!$C$26)*100","v":0},{"$f":"(O86/Instructions!$C$27)*100","v":0},{"$f":"(P86/Instructions!$C$28)*100","v":0},{"$f":"(Q86/Instructions!$C$29)*100","v":0},{"$f":"(R86/Instructions!$C$30)*100","v":0},{"$f":"(S86/Instructions!$C$31)*100","v":0},{"$f":"(T86/Instructions!$C$30)*100","v":0},{"$f":"(U86/Instructions!$C$33)*100","v":{"$error":"#VALUE!"}},"----","E","E","E","E","E","E","E","E","E","E","--",null,null,null,null,null,{"$f":"Table_2[[#This Row],[Column51]]&Table_2[[#This Row],[Column52]]&AW88","v":""}]
[86,null,null,null,null,null,null,null,null,null,null,null,null,null,null,null,null,null,null,null,"--",0,null,null,{"$f":"(K87/Instructions!$C$23)*100","v":0},{"$f":"(L87/Instructions!$C$24)*100","v":0},{"$f":"(M87/Instructions!$C$25)*100","v":0},{"$f":"(N87/Instructions!$C$26)*100","v":0},{"$f":"(O87/Instructions!$C$27)*100","v":0},{"$f":"(P87/Instructions!$C$28)*100","v":0},{"$f":"(Q87/Instructions!$C$29)*100","v":0},{"$f":"(R87/Instructions!$C$30)*100","v":0},{"$f":"(S87/Instructions!$C$31)*100","v":0},{"$f":"(T87/Instructions!$C$30)*100","v":0},{"$f":"(U87/Instructions!$C$33)*100","v":{"$error":"#VALUE!"}},"----","E","E","E","E","E","E","E","E","E","E","--",null,null,null,null,null,{"$f":"Table_2[[#This Row],[Column51]]&Table_2[[#This Row],[Column52]]&AW89","v":""}]
[87,null,null,null,null,null,null,null,null,null,null,null,null,null,null,null,null,null,null,null,"--",0,null,null,{"$f":"(K88/Instructions!$C$23)*100","v":0},{"$f":"(L88/Instructions!$C$24)*100","v":0},{"$f":"(M88/Instructions!$C$25)*100","v":0},{"$f":"(N88/Instructions!$C$26)*100","v":0},{"$f":"(O88/Instructions!$C$27)*100","v":0},{"$f":"(P88/Instructions!$C$28)*100","v":0},{"$f":"(Q88/Instructions!$C$29)*100","v":0},{"$f":"(R88/Instructions!$C$30)*100","v":0},{"$f":"(S88/Instructions!$C$31)*100","v":0},{"$f":"(T88/Instructions!$C$30)*100","v":0},{"$f":"(U88/Instructions!$C$33)*100","v":{"$error":"#VALUE!"}},"----","E","E","E","E","E","E","E","E","E","E","--",null,null,null,null,null,{"$f":"Table_2[[#This Row],[Column51]]&Table_2[[#This Row],[Column52]]&AW90","v":""}]
[88,null,null,null,null,null,null,null,null,null,null,null,null,null,null,null,null,null,null,null,"--",0,null,null,{"$f":"(K89/Instructions!$C$23)*100","v":0},{"$f":"(L89/Instructions!$C$24)*100","v":0},{"$f":"(M89/Instructions!$C$25)*100","v":0},{"$f":"(N89/Instructions!$C$26)*100","v":0},{"$f":"(O89/Instructions!$C$27)*100","v":0},{"$f":"(P89/Instructions!$C$28)*100","v":0},{"$f":"(Q89/Instructions!$C$29)*100","v":0},{"$f":"(R89/Instructions!$C$30)*100","v":0},{"$f":"(S89/Instructions!$C$31)*100","v":0},{"$f":"(T89/Instructions!$C$30)*100","v":0},{"$f":"(U89/Instructions!$C$33)*100","v":{"$error":"#VALUE!"}},"----","E","E","E","E","E","E","E","E","E","E","--",null,null,null,null,null,{"$f":"Table_2[[#This Row],[Column51]]&Table_2[[#This Row],[Column52]]&AW91","v":""}]
[89,null,null,null,null,null,null,null,null,null,null,null,null,null,null,null,null,null,null,null,"--",0,null,null,{"$f":"(K90/Instructions!$C$23)*100","v":0},{"$f":"(L90/Instructions!$C$24)*100","v":0},{"$f":"(M90/Instructions!$C$25)*100","v":0},{"$f":"(N90/Instructions!$C$26)*100","v":0},{"$f":"(O90/Instructions!$C$27)*100","v":0},{"$f":"(P90/Instructions!$C$28)*100","v":0},{"$f":"(Q90/Instructions!$C$29)*100","v":0},{"$f":"(R90/Instructions!$C$30)*100","v":0},{"$f":"(S90/Instructions!$C$31)*100","v":0},{"$f":"(T90/Instructions!$C$30)*100","v":0},{"$f":"(U90/Instructions!$C$33)*100","v":{"$error":"#VALUE!"}},"----","E","E","E","E","E","E","E","E","E","E","--",null,null,null,null,null,{"$f":"Table_2[[#This Row],[Column51]]&Table_2[[#This Row],[Column52]]&AW92","v":""}]
[90,null,null,null,null,null,null,null,null,null,null,null,null,null,null,null,null,null,null,null,"--",0,null,null,{"$f":"(K91/Instructions!$C$23)*100","v":0},{"$f":"(L91/Instructions!$C$24)*100","v":0},{"$f":"(M91/Instructions!$C$25)*100","v":0},{"$f":"(N91/Instructions!$C$26)*100","v":0},{"$f":"(O91/Instructions!$C$27)*100","v":0},{"$f":"(P91/Instructions!$C$28)*100","v":0},{"$f":"(Q91/Instructions!$C$29)*100","v":0},{"$f":"(R91/Instructions!$C$30)*100","v":0},{"$f":"(S91/Instructions!$C$31)*100","v":0},{"$f":"(T91/Instructions!$C$30)*100","v":0},{"$f":"(U91/Instructions!$C$33)*100","v":{"$error":"#VALUE!"}},"----","E","E","E","E","E","E","E","E","E","E","--",null,null,null,null,null,{"$f":"Table_2[[#This Row],[Column51]]&Table_2[[#This Row],[Column52]]&AW93","v":""}]
[91,null,null,null,null,null,null,null,null,null,null,null,null,null,null,null,null,null,null,null,"--",0,null,null,{"$f":"(K92/Instructions!$C$23)*100","v":0},{"$f":"(L92/Instructions!$C$24)*100","v":0},{"$f":"(M92/Instructions!$C$25)*100","v":0},{"$f":"(N92/Instructions!$C$26)*100","v":0},{"$f":"(O92/Instructions!$C$27)*100","v":0},{"$f":"(P92/Instructions!$C$28)*100","v":0},{"$f":"(Q92/Instructions!$C$29)*100","v":0},{"$f":"(R92/Instructions!$C$30)*100","v":0},{"$f":"(S92/Instructions!$C$31)*100","v":0},{"$f":"(T92/Instructions!$C$30)*100","v":0},{"$f":"(U92/Instructions!$C$33)*100","v":{"$error":"#VALUE!"}},"----","E","E","E","E","E","E","E","E","E","E","--",null,null,null,null,null,{"$f":"Table_2[[#This Row],[Column51]]&Table_2[[#This Row],[Column52]]&AW94","v":""}]
[92,null,null,null,null,null,null,null,null,null,null,null,null,null,null,null,null,null,null,null,"--",0,null,null,{"$f":"(K93/Instructions!$C$23)*100","v":0},{"$f":"(L93/Instructions!$C$24)*100","v":0},{"$f":"(M93/Instructions!$C$25)*100","v":0},{"$f":"(N93/Instructions!$C$26)*100","v":0},{"$f":"(O93/Instructions!$C$27)*100","v":0},{"$f":"(P93/Instructions!$C$28)*100","v":0},{"$f":"(Q93/Instructions!$C$29)*100","v":0},{"$f":"(R93/Instructions!$C$30)*100","v":0},{"$f":"(S93/Instructions!$C$31)*100","v":0},{"$f":"(T93/Instructions!$C$30)*100","v":0},{"$f":"(U93/Instructions!$C$33)*100","v":{"$error":"#VALUE!"}},"----","E","E","E","E","E","E","E","E","E","E","--",null,null,null,null,null,{"$f":"Table_2[[#This Row],[Column51]]&Table_2[[#This Row],[Column52]]&AW95","v":""}]
[93,null,null,null,null,null,null,null,null,null,null,null,null,null,null,null,null,null,null,null,"--",0,null,null,{"$f":"(K94/Instructions!$C$23)*100","v":0},{"$f":"(L94/Instructions!$C$24)*100","v":0},{"$f":"(M94/Instructions!$C$25)*100","v":0},{"$f":"(N94/Instructions!$C$26)*100","v":0},{"$f":"(O94/Instructions!$C$27)*100","v":0},{"$f":"(P94/Instructions!$C$28)*100","v":0},{"$f":"(Q94/Instructions!$C$29)*100","v":0},{"$f":"(R94/Instructions!$C$30)*100","v":0},{"$f":"(S94/Instructions!$C$31)*100","v":0},{"$f":"(T94/Instructions!$C$30)*100","v":0},{"$f":"(U94/Instructions!$C$33)*100","v":{"$error":"#VALUE!"}},"----","E","E","E","E","E","E","E","E","E","E","--",null,null,null,null,null,{"$f":"Table_2[[#This Row],[Column51]]&Table_2[[#This Row],[Column52]]&AW96","v":""}]
[94,null,null,null,null,null,null,null,null,null,null,null,null,null,null,null,null,null,null,null,"--",0,null,null,{"$f":"(K95/Instructions!$C$23)*100","v":0},{"$f":"(L95/Instructions!$C$24)*100","v":0},{"$f":"(M95/Instructions!$C$25)*100","v":0},{"$f":"(N95/Instructions!$C$26)*100","v":0},{"$f":"(O95/Instructions!$C$27)*100","v":0},{"$f":"(P95/Instructions!$C$28)*100","v":0},{"$f":"(Q95/Instructions!$C$29)*100","v":0},{"$f":"(R95/Instructions!$C$30)*100","v":0},{"$f":"(S95/Instructions!$C$31)*100","v":0},{"$f":"(T95/Instructions!$C$30)*100","v":0},{"$f":"(U95/Instructions!$C$33)*100","v":{"$error":"#VALUE!"}},"----","E","E","E","E","E","E","E","E","E","E","--",null,null,null,null,null,{"$f":"Table_2[[#This Row],[Column51]]&Table_2[[#This Row],[Column52]]&AW97","v":""}]
[95,null,null,null,null,null,null,null,null,null,null,null,null,null,null,null,null,null,null,null,"--",0,null,null,{"$f":"(K96/Instructions!$C$23)*100","v":0},{"$f":"(L96/Instructions!$C$24)*100","v":0},{"$f":"(M96/Instructions!$C$25)*100","v":0},{"$f":"(N96/Instructions!$C$26)*100","v":0},{"$f":"(O96/Instructions!$C$27)*100","v":0},{"$f":"(P96/Instructions!$C$28)*100","v":0},{"$f":"(Q96/Instructions!$C$29)*100","v":0},{"$f":"(R96/Instructions!$C$30)*100","v":0},{"$f":"(S96/Instructions!$C$31)*100","v":0},{"$f":"(T96/Instructions!$C$30)*100","v":0},{"$f":"(U96/Instructions!$C$33)*100","v":{"$error":"#VALUE!"}},"----","E","E","E","E","E","E","E","E","E","E","--",null,null,null,null,null,{"$f":"Table_2[[#This Row],[Column51]]&Table_2[[#This Row],[Column52]]&AW98","v":""}]
[96,null,null,null,null,null,null,null,null,null,null,null,null,null,null,null,null,null,null,null,"--",0,null,null,{"$f":"(K97/Instructions!$C$23)*100","v":0},{"$f":"(L97/Instructions!$C$24)*100","v":0},{"$f":"(M97/Instructions!$C$25)*100","v":0},{"$f":"(N97/Instructions!$C$26)*100","v":0},{"$f":"(O97/Instructions!$C$27)*100","v":0},{"$f":"(P97/Instructions!$C$28)*100","v":0},{"$f":"(Q97/Instructions!$C$29)*100","v":0},{"$f":"(R97/Instructions!$C$30)*100","v":0},{"$f":"(S97/Instructions!$C$31)*100","v":0},{"$f":"(T97/Instructions!$C$30)*100","v":0},{"$f":"(U97/Instructions!$C$33)*100","v":{"$error":"#VALUE!"}},"----","E","E","E","E","E","E","E","E","E","E","--",null,null,null,null,null,{"$f":"Table_2[[#This Row],[Column51]]&Table_2[[#This Row],[Column52]]&AW99","v":""}]
[97,null,null,null,null,null,null,null,null,null,null,null,null,null,null,null,null,null,null,null,"--",0,null,null,{"$f":"(K98/Instructions!$C$23)*100","v":0},{"$f":"(L98/Instructions!$C$24)*100","v":0},{"$f":"(M98/Instructions!$C$25)*100","v":0},{"$f":"(N98/Instructions!$C$26)*100","v":0},{"$f":"(O98/Instructions!$C$27)*100","v":0},{"$f":"(P98/Instructions!$C$28)*100","v":0},{"$f":"(Q98/Instructions!$C$29)*100","v":0},{"$f":"(R98/Instructions!$C$30)*100","v":0},{"$f":"(S98/Instructions!$C$31)*100","v":0},{"$f":"(T98/Instructions!$C$30)*100","v":0},{"$f":"(U98/Instructions!$C$33)*100","v":{"$error":"#VALUE!"}},"----","E","E","E","E","E","E","E","E","E","E","--",null,null,null,null,null,{"$f":"Table_2[[#This Row],[Column51]]&Table_2[[#This Row],[Column52]]&AW100","v":""}]
[98,null,null,null,null,null,null,null,null,null,null,null,null,null,null,null,null,null,null,null,"--",0,null,null,{"$f":"(K99/Instructions!$C$23)*100","v":0},{"$f":"(L99/Instructions!$C$24)*100","v":0},{"$f":"(M99/Instructions!$C$25)*100","v":0},{"$f":"(N99/Instructions!$C$26)*100","v":0},{"$f":"(O99/Instructions!$C$27)*100","v":0},{"$f":"(P99/Instructions!$C$28)*100","v":0},{"$f":"(Q99/Instructions!$C$29)*100","v":0},{"$f":"(R99/Instructions!$C$30)*100","v":0},{"$f":"(S99/Instructions!$C$31)*100","v":0},{"$f":"(T99/Instructions!$C$30)*100","v":0},{"$f":"(U99/Instructions!$C$33)*100","v":{"$error":"#VALUE!"}},"----","E","E","E","E","E","E","E","E","E","E","--",null,null,null,null,null,{"$f":"Table_2[[#This Row],[Column51]]&Table_2[[#This Row],[Column52]]&AW101","v":""}]
[99,null,null,null,null,null,null,null,null,null,null,null,null,null,null,null,null,null,null,null,"--",0,null,null,{"$f":"(K100/Instructions!$C$23)*100","v":0},{"$f":"(L100/Instructions!$C$24)*100","v":0},{"$f":"(M100/Instructions!$C$25)*100","v":0},{"$f":"(N100/Instructions!$C$26)*100","v":0},{"$f":"(O100/Instructions!$C$27)*100","v":0},{"$f":"(P100/Instructions!$C$28)*100","v":0},{"$f":"(Q100/Instructions!$C$29)*100","v":0},{"$f":"(R100/Instructions!$C$30)*100","v":0},{"$f":"(S100/Instructions!$C$31)*100","v":0},{"$f":"(T100/Instructions!$C$30)*100","v":0},{"$f":"(U100/Instructions!$C$33)*100","v":{"$error":"#VALUE!"}},"----","E","E","E","E","E","E","E","E","E","E","--",null,null,null,null,null,{"$f":"Table_2[[#This Row],[Column51]]&Table_2[[#This Row],[Column52]]&AW102","v":""}]
[100,null,null,null,null,null,null,null,null,null,null,null,null,null,null,null,null,null,null,null,"--",0,null,null,{"$f":"(K101/Instructions!$C$23)*100","v":0},{"$f":"(L101/Instructions!$C$24)*100","v":0},{"$f":"(M101/Instructions!$C$25)*100","v":0},{"$f":"(N101/Instructions!$C$26)*100","v":0},{"$f":"(O101/Instructions!$C$27)*100","v":0},{"$f":"(P101/Instructions!$C$28)*100","v":0},{"$f":"(Q101/Instructions!$C$29)*100","v":0},{"$f":"(R101/Instructions!$C$30)*100","v":0},{"$f":"(S101/Instructions!$C$31)*100","v":0},{"$f":"(T101/Instructions!$C$30)*100","v":0},{"$f":"(U101/Instructions!$C$33)*100","v":{"$error":"#VALUE!"}},"----","E","E","E","E","E","E","E","E","E","E","--",null,null,null,null,null,{"$f":"Table_2[[#This Row],[Column51]]&Table_2[[#This Row],[Column52]]&AW103","v":""}]
[101,null,null,null,null,null,null,null,null,null,null,null,null,null,null,null,null,null,null,null,"--",0,null,null,{"$f":"(K102/Instructions!$C$23)*100","v":0},{"$f":"(L102/Instructions!$C$24)*100","v":0},{"$f":"(M102/Instructions!$C$25)*100","v":0},{"$f":"(N102/Instructions!$C$26)*100","v":0},{"$f":"(O102/Instructions!$C$27)*100","v":0},{"$f":"(P102/Instructions!$C$28)*100","v":0},{"$f":"(Q102/Instructions!$C$29)*100","v":0},{"$f":"(R102/Instructions!$C$30)*100","v":0},{"$f":"(S102/Instructions!$C$31)*100","v":0},{"$f":"(T102/Instructions!$C$30)*100","v":0},{"$f":"(U102/Instructions!$C$33)*100","v":{"$error":"#VALUE!"}},"----","E","E","E","E","E","E","E","E","E","E","--",null,null,null,null,null,{"$f":"Table_2[[#This Row],[Column51]]&Table_2[[#This Row],[Column52]]&AW104","v":""}]
[102,null,null,null,null,null,null,null,null,null,null,null,null,null,null,null,null,null,null,null,"--",0,null,null,{"$f":"(K103/Instructions!$C$23)*100","v":0},{"$f":"(L103/Instructions!$C$24)*100","v":0},{"$f":"(M103/Instructions!$C$25)*100","v":0},{"$f":"(N103/Instructions!$C$26)*100","v":0},{"$f":"(O103/Instructions!$C$27)*100","v":0},{"$f":"(P103/Instructions!$C$28)*100","v":0},{"$f":"(Q103/Instructions!$C$29)*100","v":0},{"$f":"(R103/Instructions!$C$30)*100","v":0},{"$f":"(S103/Instructions!$C$31)*100","v":0},{"$f":"(T103/Instructions!$C$30)*100","v":0},{"$f":"(U103/Instructions!$C$33)*100","v":{"$error":"#VALUE!"}},"----","E","E","E","E","E","E","E","E","E","E","--",null,null,null,null,null,{"$f":"Table_2[[#This Row],[Column51]]&Table_2[[#This Row],[Column52]]&AW105","v":""}]
[103,null,null,null,null,null,null,null,null,null,null,null,null,null,null,null,null,null,null,null,"--",0,null,null,{"$f":"(K104/Instructions!$C$23)*100","v":0},{"$f":"(L104/Instructions!$C$24)*100","v":0},{"$f":"(M104/Instructions!$C$25)*100","v":0},{"$f":"(N104/Instructions!$C$26)*100","v":0},{"$f":"(O104/Instructions!$C$27)*100","v":0},{"$f":"(P104/Instructions!$C$28)*100","v":0},{"$f":"(Q104/Instructions!$C$29)*100","v":0},{"$f":"(R104/Instructions!$C$30)*100","v":0},{"$f":"(S104/Instructions!$C$31)*100","v":0},{"$f":"(T104/Instructions!$C$30)*100","v":0},{"$f":"(U104/Instructions!$C$33)*100","v":{"$error":"#VALUE!"}},"----","E","E","E","E","E","E","E","E","E","E","--",null,null,null,null,null,{"$f":"Table_2[[#This Row],[Column51]]&Table_2[[#This Row],[Column52]]&AW106","v":""}]
[104,null,null,null,null,null,null,null,null,null,null,null,null,null,null,null,null,null,null,null,"--",0,null,null,{"$f":"(K105/Instructions!$C$23)*100","v":0},{"$f":"(L105/Instructions!$C$24)*100","v":0},{"$f":"(M105/Instructions!$C$25)*100","v":0},{"$f":"(N105/Instructions!$C$26)*100","v":0},{"$f":"(O105/Instructions!$C$27)*100","v":0},{"$f":"(P105/Instructions!$C$28)*100","v":0},{"$f":"(Q105/Instructions!$C$29)*100","v":0},{"$f":"(R105/Instructions!$C$30)*100","v":0},{"$f":"(S105/Instructions!$C$31)*100","v":0},{"$f":"(T105/Instructions!$C$30)*100","v":0},{"$f":"(U105/Instructions!$C$33)*100","v":{"$error":"#VALUE!"}},"----","E","E","E","E","E","E","E","E","E","E","--",null,null,null,null,null,{"$f":"Table_2[[#This Row],[Column51]]&Table_2[[#This Row],[Column52]]&AW107","v":""}]
[105,null,null,null,null,null,null,null,null,null,null,null,null,null,null,null,null,null,null,null,"--",0,null,null,{"$f":"(K106/Instructions!$C$23)*100","v":0},{"$f":"(L106/Instructions!$C$24)*100","v":0},{"$f":"(M106/Instructions!$C$25)*100","v":0},{"$f":"(N106/Instructions!$C$26)*100","v":0},{"$f":"(O106/Instructions!$C$27)*100","v":0},{"$f":"(P106/Instructions!$C$28)*100","v":0},{"$f":"(Q106/Instructions!$C$29)*100","v":0},{"$f":"(R106/Instructions!$C$30)*100","v":0},{"$f":"(S106/Instructions!$C$31)*100","v":0},{"$f":"(T106/Instructions!$C$30)*100","v":0},{"$f":"(U106/Instructions!$C$33)*100","v":{"$error":"#VALUE!"}},"----","E","E","E","E","E","E","E","E","E","E","--",null,null,null,null,null,{"$f":"Table_2[[#This Row],[Column51]]&Table_2[[#This Row],[Column52]]&AW108","v":""}]
[106,null,null,null,null,null,null,null,null,null,null,null,null,null,null,null,null,null,null,null,"--",0,null,null,{"$f":"(K107/Instructions!$C$23)*100","v":0},{"$f":"(L107/Instructions!$C$24)*100","v":0},{"$f":"(M107/Instructions!$C$25)*100","v":0},{"$f":"(N107/Instructions!$C$26)*100","v":0},{"$f":"(O107/Instructions!$C$27)*100","v":0},{"$f":"(P107/Instructions!$C$28)*100","v":0},{"$f":"(Q107/Instructions!$C$29)*100","v":0},{"$f":"(R107/Instructions!$C$30)*100","v":0},{"$f":"(S107/Instructions!$C$31)*100","v":0},{"$f":"(T107/Instructions!$C$30)*100","v":0},{"$f":"(U107/Instructions!$C$33)*100","v":{"$error":"#VALUE!"}},"----","E","E","E","E","E","E","E","E","E","E","--",null,null,null,null,null,{"$f":"Table_2[[#This Row],[Column51]]&Table_2[[#This Row],[Column52]]&AW109","v":""}]
[107,null,null,null,null,null,null,null,null,null,null,null,null,null,null,null,null,null,null,null,"--",0,null,null,{"$f":"(K108/Instructions!$C$23)*100","v":0},{"$f":"(L108/Instructions!$C$24)*100","v":0},{"$f":"(M108/Instructions!$C$25)*100","v":0},{"$f":"(N108/Instructions!$C$26)*100","v":0},{"$f":"(O108/Instructions!$C$27)*100","v":0},{"$f":"(P108/Instructions!$C$28)*100","v":0},{"$f":"(Q108/Instructions!$C$29)*100","v":0},{"$f":"(R108/Instructions!$C$30)*100","v":0},{"$f":"(S108/Instructions!$C$31)*100","v":0},{"$f":"(T108/Instructions!$C$30)*100","v":0},{"$f":"(U108/Instructions!$C$33)*100","v":{"$error":"#VALUE!"}},"----","E","E","E","E","E","E","E","E","E","E","--",null,null,null,null,null,{"$f":"Table_2[[#This Row],[Column51]]&Table_2[[#This Row],[Column52]]&AW110","v":""}]
[108,null,null,null,null,null,null,null,null,null,null,null,null,null,null,null,null,null,null,null,"--",0,null,null,{"$f":"(K109/Instructions!$C$23)*100","v":0},{"$f":"(L109/Instructions!$C$24)*100","v":0},{"$f":"(M109/Instructions!$C$25)*100","v":0},{"$f":"(N109/Instructions!$C$26)*100","v":0},{"$f":"(O109/Instructions!$C$27)*100","v":0},{"$f":"(P109/Instructions!$C$28)*100","v":0},{"$f":"(Q109/Instructions!$C$29)*100","v":0},{"$f":"(R109/Instructions!$C$30)*100","v":0},{"$f":"(S109/Instructions!$C$31)*100","v":0},{"$f":"(T109/Instructions!$C$30)*100","v":0},{"$f":"(U109/Instructions!$C$33)*100","v":{"$error":"#VALUE!"}},"----","E","E","E","E","E","E","E","E","E","E","--",null,null,null,null,null,{"$f":"Table_2[[#This Row],[Column51]]&Table_2[[#This Row],[Column52]]&AW111","v":""}]
[109,null,null,null,null,null,null,null,null,null,null,null,null,null,null,null,null,null,null,null,"--",0,null,null,{"$f":"(K110/Instructions!$C$23)*100","v":0},{"$f":"(L110/Instructions!$C$24)*100","v":0},{"$f":"(M110/Instructions!$C$25)*100","v":0},{"$f":"(N110/Instructions!$C$26)*100","v":0},{"$f":"(O110/Instructions!$C$27)*100","v":0},{"$f":"(P110/Instructions!$C$28)*100","v":0},{"$f":"(Q110/Instructions!$C$29)*100","v":0},{"$f":"(R110/Instructions!$C$30)*100","v":0},{"$f":"(S110/Instructions!$C$31)*100","v":0},{"$f":"(T110/Instructions!$C$30)*100","v":0},{"$f":"(U110/Instructions!$C$33)*100","v":{"$error":"#VALUE!"}},"----","E","E","E","E","E","E","E","E","E","E","--",null,null,null,null,null,{"$f":"Table_2[[#This Row],[Column51]]&Table_2[[#This Row],[Column52]]&AW112","v":""}]
[110,null,null,null,null,null,null,null,null,null,null,null,null,null,null,null,null,null,null,null,"--",0,null,null,{"$f":"(K111/Instructions!$C$23)*100","v":0},{"$f":"(L111/Instructions!$C$24)*100","v":0},{"$f":"(M111/Instructions!$C$25)*100","v":0},{"$f":"(N111/Instructions!$C$26)*100","v":0},{"$f":"(O111/Instructions!$C$27)*100","v":0},{"$f":"(P111/Instructions!$C$28)*100","v":0},{"$f":"(Q111/Instructions!$C$29)*100","v":0},{"$f":"(R111/Instructions!$C$30)*100","v":0},{"$f":"(S111/Instructions!$C$31)*100","v":0},{"$f":"(T111/Instructions!$C$30)*100","v":0},{"$f":"(U111/Instructions!$C$33)*100","v":{"$error":"#VALUE!"}},"----","E","E","E","E","E","E","E","E","E","E","--",null,null,null,null,null,{"$f":"Table_2[[#This Row],[Column51]]&Table_2[[#This Row],[Column52]]&AW113","v":""}]
[111,null,null,null,null,null,null,null,null,null,null,null,null,null,null,null,null,null,null,null,"--",0,null,null,{"$f":"(K112/Instructions!$C$23)*100","v":0},{"$f":"(L112/Instructions!$C$24)*100","v":0},{"$f":"(M112/Instructions!$C$25)*100","v":0},{"$f":"(N112/Instructions!$C$26)*100","v":0},{"$f":"(O112/Instructions!$C$27)*100","v":0},{"$f":"(P112/Instructions!$C$28)*100","v":0},{"$f":"(Q112/Instructions!$C$29)*100","v":0},{"$f":"(R112/Instructions!$C$30)*100","v":0},{"$f":"(S112/Instructions!$C$31)*100","v":0},{"$f":"(T112/Instructions!$C$30)*100","v":0},{"$f":"(U112/Instructions!$C$33)*100","v":{"$error":"#VALUE!"}},"----","E","E","E","E","E","E","E","E","E","E","--",null,null,null,null,null,{"$f":"Table_2[[#This Row],[Column51]]&Table_2[[#This Row],[Column52]]&AW114","v":""}]
[112,null,null,null,null,null,null,null,null,null,null,null,null,null,null,null,null,null,null,null,"--",0,null,null,{"$f":"(K113/Instructions!$C$23)*100","v":0},{"$f":"(L113/Instructions!$C$24)*100","v":0},{"$f":"(M113/Instructions!$C$25)*100","v":0},{"$f":"(N113/Instructions!$C$26)*100","v":0},{"$f":"(O113/Instructions!$C$27)*100","v":0},{"$f":"(P113/Instructions!$C$28)*100","v":0},{"$f":"(Q113/Instructions!$C$29)*100","v":0},{"$f":"(R113/Instructions!$C$30)*100","v":0},{"$f":"(S113/Instructions!$C$31)*100","v":0},{"$f":"(T113/Instructions!$C$30)*100","v":0},{"$f":"(U113/Instructions!$C$33)*100","v":{"$error":"#VALUE!"}},"----","E","E","E","E","E","E","E","E","E","E","--",null,null,null,null,null,{"$f":"Table_2[[#This Row],[Column51]]&Table_2[[#This Row],[Column52]]&AW115","v":""}]
[113,null,null,null,null,null,null,null,null,null,null,null,null,null,null,null,null,null,null,null,"--",0,null,null,{"$f":"(K114/Instructions!$C$23)*100","v":0},{"$f":"(L114/Instructions!$C$24)*100","v":0},{"$f":"(M114/Instructions!$C$25)*100","v":0},{"$f":"(N114/Instructions!$C$26)*100","v":0},{"$f":"(O114/Instructions!$C$27)*100","v":0},{"$f":"(P114/Instructions!$C$28)*100","v":0},{"$f":"(Q114/Instructions!$C$29)*100","v":0},{"$f":"(R114/Instructions!$C$30)*100","v":0},{"$f":"(S114/Instructions!$C$31)*100","v":0},{"$f":"(T114/Instructions!$C$30)*100","v":0},{"$f":"(U114/Instructions!$C$33)*100","v":{"$error":"#VALUE!"}},"----","E","E","E","E","E","E","E","E","E","E","--",null,null,null,null,null,{"$f":"Table_2[[#This Row],[Column51]]&Table_2[[#This Row],[Column52]]&AW116","v":""}]
[114,null,null,null,null,null,null,null,null,null,null,null,null,null,null,null,null,null,null,null,"--",0,null,null,{"$f":"(K115/Instructions!$C$23)*100","v":0},{"$f":"(L115/Instructions!$C$24)*100","v":0},{"$f":"(M115/Instructions!$C$25)*100","v":0},{"$f":"(N115/Instructions!$C$26)*100","v":0},{"$f":"(O115/Instructions!$C$27)*100","v":0},{"$f":"(P115/Instructions!$C$28)*100","v":0},{"$f":"(Q115/Instructions!$C$29)*100","v":0},{"$f":"(R115/Instructions!$C$30)*100","v":0},{"$f":"(S115/Instructions!$C$31)*100","v":0},{"$f":"(T115/Instructions!$C$30)*100","v":0},{"$f":"(U115/Instructions!$C$33)*100","v":{"$error":"#VALUE!"}},{"$f":"IF(AND(Y115>=33,Z115>=33,AA115>=33,AB115>=33,AC115>=33,AD115>=33),\"PASS\",\"----\")","v":"----"},"E","E","E","E","E","E","E","E","E","E","--",null,null,null,null,null,{"$f":"Table_2[[#This Row],[Column51]]&Table_2[[#This Row],[Column52]]&AW117","v":""}]
[115,null,null,null,null,null,null,null,null,null,null,null,null,null,null,null,null,null,null,null,"--",0,null,null,{"$f":"(K116/Instructions!$C$23)*100","v":0},{"$f":"(L116/Instructions!$C$24)*100","v":0},{"$f":"(M116/Instructions!$C$25)*100","v":0},{"$f":"(N116/Instructions!$C$26)*100","v":0},{"$f":"(O116/Instructions!$C$27)*100","v":0},{"$f":"(P116/Instructions!$C$28)*100","v":0},{"$f":"(Q116/Instructions!$C$29)*100","v":0},{"$f":"(R116/Instructions!$C$30)*100","v":0},{"$f":"(S116/Instructions!$C$31)*100","v":0},{"$f":"(T116/Instructions!$C$30)*100","v":0},{"$f":"(U116/Instructions!$C$33)*100","v":{"$error":"#VALUE!"}},"----",{"$f":"IFERROR(IF(Y116>90,\"A+\",IF(Y116>80,\"A\",IF(Y116>70,\"B+\",IF(Y116>60,\"B\",IF(Y116>50,\"C+\",IF(Y116>40,\"C\",IF(Y116>=33,\"D\",\"E\"))))))),\"Abs\")","v":"E"},{"$f":"IFERROR(IF(Z116>90,\"A+\",IF(Z116>80,\"A\",IF(Z116>70,\"B+\",IF(Z116>60,\"B\",IF(Z116>50,\"C+\",IF(Z116>40,\"C\",IF(Z116>=33,\"D\",\"E\"))))))),\"Abs\")","v":"E"},{"$f":"IFERROR(IF(AA116>90,\"A+\",IF(AA116>80,\"A\",IF(AA116>70,\"B+\",IF(AA116>60,\"B\",IF(AA116>50,\"C+\",IF(AA116>40,\"C\",IF(AA116>=33,\"D\",\"E\"))))))),\"Abs\")","v":"E"},{"$f":"IFERROR(IF(AB116>90,\"A+\",IF(AB116>80,\"A\",IF(AB116>70,\"B+\",IF(AB116>60,\"B\",IF(AB116>50,\"C+\",IF(AB116>40,\"C\",IF(AB116>=33,\"D\",\"E\"))))))),\"Abs\")","v":"E"},{"$f":"IFERROR(IF(AC116>90,\"A+\",IF(AC116>80,\"A\",IF(AC116>70,\"B+\",IF(AC116>60,\"B\",IF(AC116>50,\"C+\",IF(AC116>40,\"C\",IF(AC116>=33,\"D\",\"E\"))))))),\"Abs\")","v":"E"},{"$f":"IFERROR(IF(AD116>90,\"A+\",IF(AD116>80,\"A\",IF(AD116>70,\"B+\",IF(AD116>60,\"B\",IF(AD116>50,\"C+\",IF(AD116>40,\"C\",IF(AD116>=33,\"D\",\"E\"))))))),\"Abs\")","v":"E"},{"$f":"IFERROR(IF(AE116>90,\"A+\",IF(AE116>80,\"A\",IF(AE116>70,\"B+\",IF(AE116>60,\"B\",IF(AE116>50,\"C+\",IF(AE116>40,\"C\",IF(AE116>=33,\"D\",\"E\"))))))),\"Abs\")","v":"E"},{"$f":"IFERROR(IF(AF116>90,\"A+\",IF(AF116>80,\"A\",IF(AF116>70,\"B+\",IF(AF116>60,\"B\",IF(AF116>50,\"C+\",IF(AF116>40,\"C\",IF(AF116>=33,\"D\",\"E\"))))))),\"Abs\")","v":"E"},{"$f":"IFERROR(IF(AG116>90,\"A+\",IF(AG116>80,\"A\",IF(AG116>70,\"B+\",IF(AG116>60,\"B\",IF(AG116>50,\"C+\",IF(AG116>40,\"C\",IF(AG116>=33,\"D\",\"E\"))))))),\"Abs\")","v":"E"},{"$f":"IFERROR(IF(AH116>90,\"A+\",IF(AH116>80,\"A\",IF(AH116>70,\"B+\",IF(AH116>60,\"B\",IF(AH116>50,\"C+\",IF(AH116>40,\"C\",IF(AH116>=33,\"D\",\"E\"))))))),\"Abs\")","v":"E"},"--",null,null,null,null,null,{"$f":"Table_2[[#This Row],[Column51]]&Table_2[[#This Row],[Column52]]&AW118","v":""}]
[116,null,null,null,null,null,null,null,null,null,null,null,null,null,null,null,null,null,null,null,"--",0,null,null,{"$f":"(K117/Instructions!$C$23)*100","v":0},{"$f":"(L117/Instructions!$C$24)*100","v":0},{"$f":"(M117/Instructions!$C$25)*100","v":0},{"$f":"(N117/Instructions!$C$26)*100","v":0},{"$f":"(O117/Instructions!$C$27)*100","v":0},{"$f":"(P117/Instructions!$C$28)*100","v":0},{"$f":"(Q117/Instructions!$C$29)*100","v":0},{"$f":"(R117/Instructions!$C$30)*100","v":0},{"$f":"(S117/Instructions!$C$31)*100","v":0},{"$f":"(T117/Instructions!$C$30)*100","v":0},{"$f":"(U117/Instructions!$C$33)*100","v":{"$error":"#VALUE!"}},"----","E","E","E","E","E","E","E","E","E","E","--",null,null,null,null,null,{"$f":"Table_2[[#This Row],[Column51]]&Table_2[[#This Row],[Column52]]&AW119","v":""}]
[117,null,null,null,null,null,null,null,null,null,null,null,null,null,null,null,null,null,null,null,"--",0,null,null,{"$f":"(K118/Instructions!$C$23)*100","v":0},{"$f":"(L118/Instructions!$C$24)*100","v":0},{"$f":"(M118/Instructions!$C$25)*100","v":0},{"$f":"(N118/Instructions!$C$26)*100","v":0},{"$f":"(O118/Instructions!$C$27)*100","v":0},{"$f":"(P118/Instructions!$C$28)*100","v":0},{"$f":"(Q118/Instructions!$C$29)*100","v":0},{"$f":"(R118/Instructions!$C$30)*100","v":0},{"$f":"(S118/Instructions!$C$31)*100","v":0},{"$f":"(T118/Instructions!$C$30)*100","v":0},{"$f":"(U118/Instructions!$C$33)*100","v":{"$error":"#VALUE!"}},"----","E","E","E","E","E","E","E","E","E","E","--",null,null,null,null,null,{"$f":"Table_2[[#This Row],[Column51]]&Table_2[[#This Row],[Column52]]&AW120","v":""}]
[118,null,null,null,null,null,null,null,null,null,null,null,null,null,null,null,null,null,null,null,"--",0,null,null,{"$f":"(K119/Instructions!$C$23)*100","v":0},{"$f":"(L119/Instructions!$C$24)*100","v":0},{"$f":"(M119/Instructions!$C$25)*100","v":0},{"$f":"(N119/Instructions!$C$26)*100","v":0},{"$f":"(O119/Instructions!$C$27)*100","v":0},{"$f":"(P119/Instructions!$C$28)*100","v":0},{"$f":"(Q119/Instructions!$C$29)*100","v":0},{"$f":"(R119/Instructions!$C$30)*100","v":0},{"$f":"(S119/Instructions!$C$31)*100","v":0},{"$f":"(T119/Instructions!$C$30)*100","v":0},{"$f":"(U119/Instructions!$C$33)*100","v":{"$error":"#VALUE!"}},"----","E","E","E","E","E","E","E","E","E","E","--",null,null,null,null,null,{"$f":"Table_2[[#This Row],[Column51]]&Table_2[[#This Row],[Column52]]&AW121","v":""}]
[119,null,null,null,null,null,null,null,null,null,null,null,null,null,null,null,null,null,null,null,"--",0,null,null,{"$f":"(K120/Instructions!$C$23)*100","v":0},{"$f":"(L120/Instructions!$C$24)*100","v":0},{"$f":"(M120/Instructions!$C$25)*100","v":0},{"$f":"(N120/Instructions!$C$26)*100","v":0},{"$f":"(O120/Instructions!$C$27)*100","v":0},{"$f":"(P120/Instructions!$C$28)*100","v":0},{"$f":"(Q120/Instructions!$C$29)*100","v":0},{"$f":"(R120/Instructions!$C$30)*100","v":0},{"$f":"(S120/Instructions!$C$31)*100","v":0},{"$f":"(T120/Instructions!$C$30)*100","v":0},{"$f":"(U120/Instructions!$C$33)*100","v":{"$error":"#VALUE!"}},"----","E","E","E","E","E","E","E","E","E","E","--",null,null,null,null,null,{"$f":"Table_2[[#This Row],[Column51]]&Table_2[[#This Row],[Column52]]&AW122","v":""}]
[120,null,null,null,null,null,null,null,null,null,null,null,null,null,null,null,null,null,null,null,"--",0,null,null,{"$f":"(K121/Instructions!$C$23)*100","v":0},{"$f":"(L121/Instructions!$C$24)*100","v":0},{"$f":"(M121/Instructions!$C$25)*100","v":0},{"$f":"(N121/Instructions!$C$26)*100","v":0},{"$f":"(O121/Instructions!$C$27)*100","v":0},{"$f":"(P121/Instructions!$C$28)*100","v":0},{"$f":"(Q121/Instructions!$C$29)*100","v":0},{"$f":"(R121/Instructions!$C$30)*100","v":0},{"$f":"(S121/Instructions!$C$31)*100","v":0},{"$f":"(T121/Instructions!$C$30)*100","v":0},{"$f":"(U121/Instructions!$C$33)*100","v":{"$error":"#VALUE!"}},"----","E","E","E","E","E","E","E","E","E","E","--",null,null,null,null,null,{"$f":"Table_2[[#This Row],[Column51]]&Table_2[[#This Row],[Column52]]&AW123","v":""}]
[121,null,null,null,null,null,null,null,null,null,null,null,null,null,null,null,null,null,null,null,"--",0,null,null,{"$f":"(K122/Instructions!$C$23)*100","v":0},{"$f":"(L122/Instructions!$C$24)*100","v":0},{"$f":"(M122/Instructions!$C$25)*100","v":0},{"$f":"(N122/Instructions!$C$26)*100","v":0},{"$f":"(O122/Instructions!$C$27)*100","v":0},{"$f":"(P122/Instructions!$C$28)*100","v":0},{"$f":"(Q122/Instructions!$C$29)*100","v":0},{"$f":"(R122/Instructions!$C$30)*100","v":0},{"$f":"(S122/Instructions!$C$31)*100","v":0},{"$f":"(T122/Instructions!$C$30)*100","v":0},{"$f":"(U122/Instructions!$C$33)*100","v":{"$error":"#VALUE!"}},"----","E","E","E","E","E","E","E","E","E","E","--",null,null,null,null,null,{"$f":"Table_2[[#This Row],[Column51]]&Table_2[[#This Row],[Column52]]&AW124","v":""}]
[122,null,null,null,null,null,null,null,null,null,null,null,null,null,null,null,null,null,null,null,"--",0,null,null,{"$f":"(K123/Instructions!$C$23)*100","v":0},{"$f":"(L123/Instructions!$C$24)*100","v":0},{"$f":"(M123/Instructions!$C$25)*100","v":0},{"$f":"(N123/Instructions!$C$26)*100","v":0},{"$f":"(O123/Instructions!$C$27)*100","v":0},{"$f":"(P123/Instructions!$C$28)*100","v":0},{"$f":"(Q123/Instructions!$C$29)*100","v":0},{"$f":"(R123/Instructions!$C$30)*100","v":0},{"$f":"(S123/Instructions!$C$31)*100","v":0},{"$f":"(T123/Instructions!$C$30)*100","v":0},{"$f":"(U123/Instructions!$C$33)*100","v":{"$error":"#VALUE!"}},"----","E","E","E","E","E","E","E","E","E","E","--",null,null,null,null,null,{"$f":"Table_2[[#This Row],[Column51]]&Table_2[[#This Row],[Column52]]&AW125","v":""}]
[123,null,null,null,null,null,null,null,null,null,null,null,null,null,null,null,null,null,null,null,"--",0,null,null,{"$f":"(K124/Instructions!$C$23)*100","v":0},{"$f":"(L124/Instructions!$C$24)*100","v":0},{"$f":"(M124/Instructions!$C$25)*100","v":0},{"$f":"(N124/Instructions!$C$26)*100","v":0},{"$f":"(O124/Instructions!$C$27)*100","v":0},{"$f":"(P124/Instructions!$C$28)*100","v":0},{"$f":"(Q124/Instructions!$C$29)*100","v":0},{"$f":"(R124/Instructions!$C$30)*100","v":0},{"$f":"(S124/Instructions!$C$31)*100","v":0},{"$f":"(T124/Instructions!$C$30)*100","v":0},{"$f":"(U124/Instructions!$C$33)*100","v":{"$error":"#VALUE!"}},"----","E","E","E","E","E","E","E","E","E","E","--",null,null,null,null,null,{"$f":"Table_2[[#This Row],[Column51]]&Table_2[[#This Row],[Column52]]&AW126","v":""}]
[124,null,null,null,null,null,null,null,null,null,null,null,null,null,null,null,null,null,null,null,"--",0,null,null,{"$f":"(K125/Instructions!$C$23)*100","v":0},{"$f":"(L125/Instructions!$C$24)*100","v":0},{"$f":"(M125/Instructions!$C$25)*100","v":0},{"$f":"(N125/Instructions!$C$26)*100","v":0},{"$f":"(O125/Instructions!$C$27)*100","v":0},{"$f":"(P125/Instructions!$C$28)*100","v":0},{"$f":"(Q125/Instructions!$C$29)*100","v":0},{"$f":"(R125/Instructions!$C$30)*100","v":0},{"$f":"(S125/Instructions!$C$31)*100","v":0},{"$f":"(T125/Instructions!$C$30)*100","v":0},{"$f":"(U125/Instructions!$C$33)*100","v":{"$error":"#VALUE!"}},"----","E","E","E","E","E","E","E","E","E","E","--",null,null,null,null,null,{"$f":"Table_2[[#This Row],[Column51]]&Table_2[[#This Row],[Column52]]&AW127","v":""}]
[125,null,null,null,null,null,null,null,null,null,null,null,null,null,null,null,null,null,null,null,"--",0,null,null,{"$f":"(K126/Instructions!$C$23)*100","v":0},{"$f":"(L126/Instructions!$C$24)*100","v":0},{"$f":"(M126/Instructions!$C$25)*100","v":0},{"$f":"(N126/Instructions!$C$26)*100","v":0},{"$f":"(O126/Instructions!$C$27)*100","v":0},{"$f":"(P126/Instructions!$C$28)*100","v":0},{"$f":"(Q126/Instructions!$C$29)*100","v":0},{"$f":"(R126/Instructions!$C$30)*100","v":0},{"$f":"(S126/Instructions!$C$31)*100","v":0},{"$f":"(T126/Instructions!$C$30)*100","v":0},{"$f":"(U126/Instructions!$C$33)*100","v":{"$error":"#VALUE!"}},"----","E","E","E","E","E","E","E","E","E","E","--",null,null,null,null,null,{"$f":"Table_2[[#This Row],[Column51]]&Table_2[[#This Row],[Column52]]&AW128","v":""}]
[126,null,null,null,null,null,null,null,null,null,null,null,null,null,null,null,null,null,null,null,"--",0,null,null,{"$f":"(K127/Instructions!$C$23)*100","v":0},{"$f":"(L127/Instructions!$C$24)*100","v":0},{"$f":"(M127/Instructions!$C$25)*100","v":0},{"$f":"(N127/Instructions!$C$26)*100","v":0},{"$f":"(O127/Instructions!$C$27)*100","v":0},{"$f":"(P127/Instructions!$C$28)*100","v":0},{"$f":"(Q127/Instructions!$C$29)*100","v":0},{"$f":"(R127/Instructions!$C$30)*100","v":0},{"$f":"(S127/Instructions!$C$31)*100","v":0},{"$f":"(T127/Instructions!$C$30)*100","v":0},{"$f":"(U127/Instructions!$C$33)*100","v":{"$error":"#VALUE!"}},"----","E","E","E","E","E","E","E","E","E","E","--",null,null,null,null,null,{"$f":"Table_2[[#This Row],[Column51]]&Table_2[[#This Row],[Column52]]&AW129","v":""}]
[127,null,null,null,null,null,null,null,null,null,null,null,null,null,null,null,null,null,null,null,"--",0,null,null,{"$f":"(K128/Instructions!$C$23)*100","v":0},{"$f":"(L128/Instructions!$C$24)*100","v":0},{"$f":"(M128/Instructions!$C$25)*100","v":0},{"$f":"(N128/Instructions!$C$26)*100","v":0},{"$f":"(O128/Instructions!$C$27)*100","v":0},{"$f":"(P128/Instructions!$C$28)*100","v":0},{"$f":"(Q128/Instructions!$C$29)*100","v":0},{"$f":"(R128/Instructions!$C$30)*100","v":0},{"$f":"(S128/Instructions!$C$31)*100","v":0},{"$f":"(T128/Instructions!$C$30)*100","v":0},{"$f":"(U128/Instructions!$C$33)*100","v":{"$error":"#VALUE!"}},"----","E","E","E","E","E","E","E","E","E","E","--",null,null,null,null,null,{"$f":"Table_2[[#This Row],[Column51]]&Table_2[[#This Row],[Column52]]&AW130","v":""}]
[128,null,null,null,null,null,null,null,null,null,null,null,null,null,null,null,null,null,null,null,"--",0,null,null,{"$f":"(K129/Instructions!$C$23)*100","v":0},{"$f":"(L129/Instructions!$C$24)*100","v":0},{"$f":"(M129/Instructions!$C$25)*100","v":0},{"$f":"(N129/Instructions!$C$26)*100","v":0},{"$f":"(O129/Instructions!$C$27)*100","v":0},{"$f":"(P129/Instructions!$C$28)*100","v":0},{"$f":"(Q129/Instructions!$C$29)*100","v":0},{"$f":"(R129/Instructions!$C$30)*100","v":0},{"$f":"(S129/Instructions!$C$31)*100","v":0},{"$f":"(T129/Instructions!$C$30)*100","v":0},{"$f":"(U129/Instructions!$C$33)*100","v":{"$error":"#VALUE!"}},"----","E","E","E","E","E","E","E","E","E","E","--",null,null,null,null,null,{"$f":"Table_2[[#This Row],[Column51]]&Table_2[[#This Row],[Column52]]&AW131","v":""}]
[129,null,null,null,null,null,null,null,null,null,null,null,null,null,null,null,null,null,null,null,"--",0,null,null,{"$f":"(K130/Instructions!$C$23)*100","v":0},{"$f":"(L130/Instructions!$C$24)*100","v":0},{"$f":"(M130/Instructions!$C$25)*100","v":0},{"$f":"(N130/Instructions!$C$26)*100","v":0},{"$f":"(O130/Instructions!$C$27)*100","v":0},{"$f":"(P130/Instructions!$C$28)*100","v":0},{"$f":"(Q130/Instructions!$C$29)*100","v":0},{"$f":"(R130/Instructions!$C$30)*100","v":0},{"$f":"(S130/Instructions!$C$31)*100","v":0},{"$f":"(T130/Instructions!$C$30)*100","v":0},{"$f":"(U130/Instructions!$C$33)*100","v":{"$error":"#VALUE!"}},"----","E","E","E","E","E","E","E","E","E","E","--",null,null,null,null,null,{"$f":"Table_2[[#This Row],[Column51]]&Table_2[[#This Row],[Column52]]&AW132","v":""}]
[130,null,null,null,null,null,null,null,null,null,null,null,null,null,null,null,null,null,null,null,{"$f":"IF(MIN(Y131:AD131)>=33,SUM(K131:P131),\"--\")","v":"--"},{"$f":"IF(U131=\"--\",0,U131)","v":0},null,null,{"$f":"(K131/Instructions!$C$23)*100","v":0},{"$f":"(L131/Instructions!$C$24)*100","v":0},{"$f":"(M131/Instructions!$C$25)*100","v":0},{"$f":"(N131/Instructions!$C$26)*100","v":0},{"$f":"(O131/Instructions!$C$27)*100","v":0},{"$f":"(P131/Instructions!$C$28)*100","v":0},{"$f":"(Q131/Instructions!$C$29)*100","v":0},{"$f":"(R131/Instructions!$C$30)*100","v":0},{"$f":"(S131/Instructions!$C$31)*100","v":0},{"$f":"(T131/Instructions!$C$30)*100","v":0},{"$f":"(U131/Instructions!$C$33)*100","v":{"$error":"#VALUE!"}},"----","E","E","E","E","E","E","E","E","E","E",{"$f":"IFERROR(IF(AI131>90,\"A+\",IF(AI131>80,\"A\",IF(AI131>70,\"B+\",IF(AI131>60,\"B\",IF(AI131>50,\"C+\",IF(AI131>40,\"C\",IF(AI131>=33,\"D\",\"E\"))))))),\"--\")","v":"--"},null,null,null,null,null,{"$f":"Table_2[[#This Row],[Column51]]&Table_2[[#This Row],[Column52]]&AW133","v":""}]
[131,null,null,null,null,null,null,null,null,null,null,null,null,null,null,null,null,null,null,null,"--",0,null,null,{"$f":"(K132/Instructions!$C$23)*100","v":0},{"$f":"(L132/Instructions!$C$24)*100","v":0},{"$f":"(M132/Instructions!$C$25)*100","v":0},{"$f":"(N132/Instructions!$C$26)*100","v":0},{"$f":"(O132/Instructions!$C$27)*100","v":0},{"$f":"(P132/Instructions!$C$28)*100","v":0},{"$f":"(Q132/Instructions!$C$29)*100","v":0},{"$f":"(R132/Instructions!$C$30)*100","v":0},{"$f":"(S132/Instructions!$C$31)*100","v":0},{"$f":"(T132/Instructions!$C$30)*100","v":0},{"$f":"(U132/Instructions!$C$33)*100","v":{"$error":"#VALUE!"}},"----","E","E","E","E","E","E","E","E","E","E","--",null,null,null,null,null,{"$f":"Table_2[[#This Row],[Column51]]&Table_2[[#This Row],[Column52]]&AW134","v":""}]
[132,null,null,null,null,null,null,null,null,null,null,null,null,null,null,null,null,null,null,null,"--",0,null,null,{"$f":"(K133/Instructions!$C$23)*100","v":0},{"$f":"(L133/Instructions!$C$24)*100","v":0},{"$f":"(M133/Instructions!$C$25)*100","v":0},{"$f":"(N133/Instructions!$C$26)*100","v":0},{"$f":"(O133/Instructions!$C$27)*100","v":0},{"$f":"(P133/Instructions!$C$28)*100","v":0},{"$f":"(Q133/Instructions!$C$29)*100","v":0},{"$f":"(R133/Instructions!$C$30)*100","v":0},{"$f":"(S133/Instructions!$C$31)*100","v":0},{"$f":"(T133/Instructions!$C$30)*100","v":0},{"$f":"(U133/Instructions!$C$33)*100","v":{"$error":"#VALUE!"}},"----","E","E","E","E","E","E","E","E","E","E","--",null,null,null,null,null,{"$f":"Table_2[[#This Row],[Column51]]&Table_2[[#This Row],[Column52]]&AW135","v":""}]
[133,null,null,null,null,null,null,null,null,null,null,null,null,null,null,null,null,null,null,null,"--",0,null,null,{"$f":"(K134/Instructions!$C$23)*100","v":0},{"$f":"(L134/Instructions!$C$24)*100","v":0},{"$f":"(M134/Instructions!$C$25)*100","v":0},{"$f":"(N134/Instructions!$C$26)*100","v":0},{"$f":"(O134/Instructions!$C$27)*100","v":0},{"$f":"(P134/Instructions!$C$28)*100","v":0},{"$f":"(Q134/Instructions!$C$29)*100","v":0},{"$f":"(R134/Instructions!$C$30)*100","v":0},{"$f":"(S134/Instructions!$C$31)*100","v":0},{"$f":"(T134/Instructions!$C$30)*100","v":0},{"$f":"(U134/Instructions!$C$33)*100","v":{"$error":"#VALUE!"}},"----","E","E","E","E","E","E","E","E","E","E","--",null,null,null,null,null,{"$f":"Table_2[[#This Row],[Column51]]&Table_2[[#This Row],[Column52]]&AW136","v":""}]
[134,null,null,null,null,null,null,null,null,null,null,null,null,null,null,null,null,null,null,null,"--",0,null,null,{"$f":"(K135/Instructions!$C$23)*100","v":0},{"$f":"(L135/Instructions!$C$24)*100","v":0},{"$f":"(M135/Instructions!$C$25)*100","v":0},{"$f":"(N135/Instructions!$C$26)*100","v":0},{"$f":"(O135/Instructions!$C$27)*100","v":0},{"$f":"(P135/Instructions!$C$28)*100","v":0},{"$f":"(Q135/Instructions!$C$29)*100","v":0},{"$f":"(R135/Instructions!$C$30)*100","v":0},{"$f":"(S135/Instructions!$C$31)*100","v":0},{"$f":"(T135/Instructions!$C$30)*100","v":0},{"$f":"(U135/Instructions!$C$33)*100","v":{"$error":"#VALUE!"}},"----","E","E","E","E","E","E","E","E","E","E","--",null,null,null,null,null,{"$f":"Table_2[[#This Row],[Column51]]&Table_2[[#This Row],[Column52]]&AW137","v":""}]
[135,null,null,null,null,null,null,null,null,null,null,null,null,null,null,null,null,null,null,null,"--",0,null,null,{"$f":"(K136/Instructions!$C$23)*100","v":0},{"$f":"(L136/Instructions!$C$24)*100","v":0},{"$f":"(M136/Instructions!$C$25)*100","v":0},{"$f":"(N136/Instructions!$C$26)*100","v":0},{"$f":"(O136/Instructions!$C$27)*100","v":0},{"$f":"(P136/Instructions!$C$28)*100","v":0},{"$f":"(Q136/Instructions!$C$29)*100","v":0},{"$f":"(R136/Instructions!$C$30)*100","v":0},{"$f":"(S136/Instructions!$C$31)*100","v":0},{"$f":"(T136/Instructions!$C$30)*100","v":0},{"$f":"(U136/Instructions!$C$33)*100","v":{"$error":"#VALUE!"}},"----","E","E","E","E","E","E","E","E","E","E","--",null,null,null,null,null,{"$f":"Table_2[[#This Row],[Column51]]&Table_2[[#This Row],[Column52]]&AW138","v":""}]
[136,null,null,null,null,null,null,null,null,null,null,null,null,null,null,null,null,null,null,null,"--",0,null,null,{"$f":"(K137/Instructions!$C$23)*100","v":0},{"$f":"(L137/Instructions!$C$24)*100","v":0},{"$f":"(M137/Instructions!$C$25)*100","v":0},{"$f":"(N137/Instructions!$C$26)*100","v":0},{"$f":"(O137/Instructions!$C$27)*100","v":0},{"$f":"(P137/Instructions!$C$28)*100","v":0},{"$f":"(Q137/Instructions!$C$29)*100","v":0},{"$f":"(R137/Instructions!$C$30)*100","v":0},{"$f":"(S137/Instructions!$C$31)*100","v":0},{"$f":"(T137/Instructions!$C$30)*100","v":0},{"$f":"(U137/Instructions!$C$33)*100","v":{"$error":"#VALUE!"}},"----","E","E","E","E","E","E","E","E","E","E","--",null,null,null,null,null,{"$f":"Table_2[[#This Row],[Column51]]&Table_2[[#This Row],[Column52]]&AW139","v":""}]
[137,null,null,null,null,null,null,null,null,null,null,null,null,null,null,null,null,null,null,null,"--",0,null,null,{"$f":"(K138/Instructions!$C$23)*100","v":0},{"$f":"(L138/Instructions!$C$24)*100","v":0},{"$f":"(M138/Instructions!$C$25)*100","v":0},{"$f":"(N138/Instructions!$C$26)*100","v":0},{"$f":"(O138/Instructions!$C$27)*100","v":0},{"$f":"(P138/Instructions!$C$28)*100","v":0},{"$f":"(Q138/Instructions!$C$29)*100","v":0},{"$f":"(R138/Instructions!$C$30)*100","v":0},{"$f":"(S138/Instructions!$C$31)*100","v":0},{"$f":"(T138/Instructions!$C$30)*100","v":0},{"$f":"(U138/Instructions!$C$33)*100","v":{"$error":"#VALUE!"}},"----","E","E","E","E","E","E","E","E","E","E","--",null,null,null,null,null,{"$f":"Table_2[[#This Row],[Column51]]&Table_2[[#This Row],[Column52]]&AW140","v":""}]
[138,null,null,null,null,null,null,null,null,null,null,null,null,null,null,null,null,null,null,null,"--",0,null,null,{"$f":"(K139/Instructions!$C$23)*100","v":0},{"$f":"(L139/Instructions!$C$24)*100","v":0},{"$f":"(M139/Instructions!$C$25)*100","v":0},{"$f":"(N139/Instructions!$C$26)*100","v":0},{"$f":"(O139/Instructions!$C$27)*100","v":0},{"$f":"(P139/Instructions!$C$28)*100","v":0},{"$f":"(Q139/Instructions!$C$29)*100","v":0},{"$f":"(R139/Instructions!$C$30)*100","v":0},{"$f":"(S139/Instructions!$C$31)*100","v":0},{"$f":"(T139/Instructions!$C$30)*100","v":0},{"$f":"(U139/Instructions!$C$33)*100","v":{"$error":"#VALUE!"}},"----","E","E","E","E","E","E","E","E","E","E","--",null,null,null,null,null,{"$f":"Table_2[[#This Row],[Column51]]&Table_2[[#This Row],[Column52]]&AW141","v":""}]
[139,null,null,null,null,null,null,null,null,null,null,null,null,null,null,null,null,null,null,null,"--",0,null,null,{"$f":"(K140/Instructions!$C$23)*100","v":0},{"$f":"(L140/Instructions!$C$24)*100","v":0},{"$f":"(M140/Instructions!$C$25)*100","v":0},{"$f":"(N140/Instructions!$C$26)*100","v":0},{"$f":"(O140/Instructions!$C$27)*100","v":0},{"$f":"(P140/Instructions!$C$28)*100","v":0},{"$f":"(Q140/Instructions!$C$29)*100","v":0},{"$f":"(R140/Instructions!$C$30)*100","v":0},{"$f":"(S140/Instructions!$C$31)*100","v":0},{"$f":"(T140/Instructions!$C$30)*100","v":0},{"$f":"(U140/Instructions!$C$33)*100","v":{"$error":"#VALUE!"}},"----","E","E","E","E","E","E","E","E","E","E","--",null,null,null,null,null,{"$f":"Table_2[[#This Row],[Column51]]&Table_2[[#This Row],[Column52]]&AW142","v":""}]
[140,null,null,null,null,null,null,null,null,null,null,null,null,null,null,null,null,null,null,null,"--",0,null,null,{"$f":"(K141/Instructions!$C$23)*100","v":0},{"$f":"(L141/Instructions!$C$24)*100","v":0},{"$f":"(M141/Instructions!$C$25)*100","v":0},{"$f":"(N141/Instructions!$C$26)*100","v":0},{"$f":"(O141/Instructions!$C$27)*100","v":0},{"$f":"(P141/Instructions!$C$28)*100","v":0},{"$f":"(Q141/Instructions!$C$29)*100","v":0},{"$f":"(R141/Instructions!$C$30)*100","v":0},{"$f":"(S141/Instructions!$C$31)*100","v":0},{"$f":"(T141/Instructions!$C$30)*100","v":0},{"$f":"(U141/Instructions!$C$33)*100","v":{"$error":"#VALUE!"}},"----","E","E","E","E","E","E","E","E","E","E","--",null,null,null,null,null,{"$f":"Table_2[[#This Row],[Column51]]&Table_2[[#This Row],[Column52]]&AW143","v":""}]
[141,null,null,null,null,null,null,null,null,null,null,null,null,null,null,null,null,null,null,null,"--",0,null,null,{"$f":"(K142/Instructions!$C$23)*100","v":0},{"$f":"(L142/Instructions!$C$24)*100","v":0},{"$f":"(M142/Instructions!$C$25)*100","v":0},{"$f":"(N142/Instructions!$C$26)*100","v":0},{"$f":"(O142/Instructions!$C$27)*100","v":0},{"$f":"(P142/Instructions!$C$28)*100","v":0},{"$f":"(Q142/Instructions!$C$29)*100","v":0},{"$f":"(R142/Instructions!$C$30)*100","v":0},{"$f":"(S142/Instructions!$C$31)*100","v":0},{"$f":"(T142/Instructions!$C$30)*100","v":0},{"$f":"(U142/Instructions!$C$33)*100","v":{"$error":"#VALUE!"}},"----","E","E","E","E","E","E","E","E","E","E","--",null,null,null,null,null,{"$f":"Table_2[[#This Row],[Column51]]&Table_2[[#This Row],[Column52]]&AW144","v":""}]
[142,null,null,null,null,null,null,null,null,null,null,null,null,null,null,null,null,null,null,null,"--",0,null,null,{"$f":"(K143/Instructions!$C$23)*100","v":0},{"$f":"(L143/Instructions!$C$24)*100","v":0},{"$f":"(M143/Instructions!$C$25)*100","v":0},{"$f":"(N143/Instructions!$C$26)*100","v":0},{"$f":"(O143/Instructions!$C$27)*100","v":0},{"$f":"(P143/Instructions!$C$28)*100","v":0},{"$f":"(Q143/Instructions!$C$29)*100","v":0},{"$f":"(R143/Instructions!$C$30)*100","v":0},{"$f":"(S143/Instructions!$C$31)*100","v":0},{"$f":"(T143/Instructions!$C$30)*100","v":0},{"$f":"(U143/Instructions!$C$33)*100","v":{"$error":"#VALUE!"}},"----","E","E","E","E","E","E","E","E","E","E","--",null,null,null,null,null,{"$f":"Table_2[[#This Row],[Column51]]&Table_2[[#This Row],[Column52]]&AW145","v":""}]
[143,null,null,null,null,null,null,null,null,null,null,null,null,null,null,null,null,null,null,null,"--",0,null,null,{"$f":"(K144/Instructions!$C$23)*100","v":0},{"$f":"(L144/Instructions!$C$24)*100","v":0},{"$f":"(M144/Instructions!$C$25)*100","v":0},{"$f":"(N144/Instructions!$C$26)*100","v":0},{"$f":"(O144/Instructions!$C$27)*100","v":0},{"$f":"(P144/Instructions!$C$28)*100","v":0},{"$f":"(Q144/Instructions!$C$29)*100","v":0},{"$f":"(R144/Instructions!$C$30)*100","v":0},{"$f":"(S144/Instructions!$C$31)*100","v":0},{"$f":"(T144/Instructions!$C$30)*100","v":0},{"$f":"(U144/Instructions!$C$33)*100","v":{"$error":"#VALUE!"}},"----","E","E","E","E","E","E","E","E","E","E","--",null,null,null,null,null,{"$f":"Table_2[[#This Row],[Column51]]&Table_2[[#This Row],[Column52]]&AW146","v":""}]
[144,null,null,null,null,null,null,null,null,null,null,null,null,null,null,null,null,null,null,null,"--",0,null,null,{"$f":"(K145/Instructions!$C$23)*100","v":0},{"$f":"(L145/Instructions!$C$24)*100","v":0},{"$f":"(M145/Instructions!$C$25)*100","v":0},{"$f":"(N145/Instructions!$C$26)*100","v":0},{"$f":"(O145/Instructions!$C$27)*100","v":0},{"$f":"(P145/Instructions!$C$28)*100","v":0},{"$f":"(Q145/Instructions!$C$29)*100","v":0},{"$f":"(R145/Instructions!$C$30)*100","v":0},{"$f":"(S145/Instructions!$C$31)*100","v":0},{"$f":"(T145/Instructions!$C$30)*100","v":0},{"$f":"(U145/Instructions!$C$33)*100","v":{"$error":"#VALUE!"}},"----","E","E","E","E","E","E","E","E","E","E","--",null,null,null,null,null,{"$f":"Table_2[[#This Row],[Column51]]&Table_2[[#This Row],[Column52]]&AW147","v":""}]
[145,null,null,null,null,null,null,null,null,null,null,null,null,null,null,null,null,null,null,null,"--",0,null,null,{"$f":"(K146/Instructions!$C$23)*100","v":0},{"$f":"(L146/Instructions!$C$24)*100","v":0},{"$f":"(M146/Instructions!$C$25)*100","v":0},{"$f":"(N146/Instructions!$C$26)*100","v":0},{"$f":"(O146/Instructions!$C$27)*100","v":0},{"$f":"(P146/Instructions!$C$28)*100","v":0},{"$f":"(Q146/Instructions!$C$29)*100","v":0},{"$f":"(R146/Instructions!$C$30)*100","v":0},{"$f":"(S146/Instructions!$C$31)*100","v":0},{"$f":"(T146/Instructions!$C$30)*100","v":0},{"$f":"(U146/Instructions!$C$33)*100","v":{"$error":"#VALUE!"}},"----","E","E","E","E","E","E","E","E","E","E","--",null,null,null,null,null,{"$f":"Table_2[[#This Row],[Column51]]&Table_2[[#This Row],[Column52]]&AW148","v":""}]
[146,null,null,null,null,null,null,null,null,null,null,null,null,null,null,null,null,null,null,null,"--",0,null,null,{"$f":"(K147/Instructions!$C$23)*100","v":0},{"$f":"(L147/Instructions!$C$24)*100","v":0},{"$f":"(M147/Instructions!$C$25)*100","v":0},{"$f":"(N147/Instructions!$C$26)*100","v":0},{"$f":"(O147/Instructions!$C$27)*100","v":0},{"$f":"(P147/Instructions!$C$28)*100","v":0},{"$f":"(Q147/Instructions!$C$29)*100","v":0},{"$f":"(R147/Instructions!$C$30)*100","v":0},{"$f":"(S147/Instructions!$C$31)*100","v":0},{"$f":"(T147/Instructions!$C$30)*100","v":0},{"$f":"(U147/Instructions!$C$33)*100","v":{"$error":"#VALUE!"}},"----","E","E","E","E","E","E","E","E","E","E","--",null,null,null,null,null,{"$f":"Table_2[[#This Row],[Column51]]&Table_2[[#This Row],[Column52]]&AW149","v":""}]
[147,null,null,null,null,null,null,null,null,null,null,null,null,null,null,null,null,null,null,null,"--",0,null,null,{"$f":"(K148/Instructions!$C$23)*100","v":0},{"$f":"(L148/Instructions!$C$24)*100","v":0},{"$f":"(M148/Instructions!$C$25)*100","v":0},{"$f":"(N148/Instructions!$C$26)*100","v":0},{"$f":"(O148/Instructions!$C$27)*100","v":0},{"$f":"(P148/Instructions!$C$28)*100","v":0},{"$f":"(Q148/Instructions!$C$29)*100","v":0},{"$f":"(R148/Instructions!$C$30)*100","v":0},{"$f":"(S148/Instructions!$C$31)*100","v":0},{"$f":"(T148/Instructions!$C$30)*100","v":0},{"$f":"(U148/Instructions!$C$33)*100","v":{"$error":"#VALUE!"}},"----","E","E","E","E","E","E","E","E","E","E","--",null,null,null,null,null,{"$f":"Table_2[[#This Row],[Column51]]&Table_2[[#This Row],[Column52]]&AW150","v":""}]
[148,null,null,null,null,null,null,null,null,null,null,null,null,null,null,null,null,null,null,null,"--",0,null,null,{"$f":"(K149/Instructions!$C$23)*100","v":0},{"$f":"(L149/Instructions!$C$24)*100","v":0},{"$f":"(M149/Instructions!$C$25)*100","v":0},{"$f":"(N149/Instructions!$C$26)*100","v":0},{"$f":"(O149/Instructions!$C$27)*100","v":0},{"$f":"(P149/Instructions!$C$28)*100","v":0},{"$f":"(Q149/Instructions!$C$29)*100","v":0},{"$f":"(R149/Instructions!$C$30)*100","v":0},{"$f":"(S149/Instructions!$C$31)*100","v":0},{"$f":"(T149/Instructions!$C$30)*100","v":0},{"$f":"(U149/Instructions!$C$33)*100","v":{"$error":"#VALUE!"}},"----","E","E","E","E","E","E","E","E","E","E","--",null,null,null,null,null,{"$f":"Table_2[[#This Row],[Column51]]&Table_2[[#This Row],[Column52]]&AW151","v":""}]
[149,null,null,null,null,null,null,null,null,null,null,null,null,null,null,null,null,null,null,null,"--",0,null,null,{"$f":"(K150/Instructions!$C$23)*100","v":0},{"$f":"(L150/Instructions!$C$24)*100","v":0},{"$f":"(M150/Instructions!$C$25)*100","v":0},{"$f":"(N150/Instructions!$C$26)*100","v":0},{"$f":"(O150/Instructions!$C$27)*100","v":0},{"$f":"(P150/Instructions!$C$28)*100","v":0},{"$f":"(Q150/Instructions!$C$29)*100","v":0},{"$f":"(R150/Instructions!$C$30)*100","v":0},{"$f":"(S150/Instructions!$C$31)*100","v":0},{"$f":"(T150/Instructions!$C$30)*100","v":0},{"$f":"(U150/Instructions!$C$33)*100","v":{"$error":"#VALUE!"}},"----","E","E","E","E","E","E","E","E","E","E","--",null,null,null,null,null,{"$f":"Table_2[[#This Row],[Column51]]&Table_2[[#This Row],[Column52]]&AW152","v":""}]
[150,null,null,null,null,null,null,null,null,null,null,null,null,null,null,null,null,null,null,null,"--",0,null,null,{"$f":"(K151/Instructions!$C$23)*100","v":0},{"$f":"(L151/Instructions!$C$24)*100","v":0},{"$f":"(M151/Instructions!$C$25)*100","v":0},{"$f":"(N151/Instructions!$C$26)*100","v":0},{"$f":"(O151/Instructions!$C$27)*100","v":0},{"$f":"(P151/Instructions!$C$28)*100","v":0},{"$f":"(Q151/Instructions!$C$29)*100","v":0},{"$f":"(R151/Instructions!$C$30)*100","v":0},{"$f":"(S151/Instructions!$C$31)*100","v":0},{"$f":"(T151/Instructions!$C$30)*100","v":0},{"$f":"(U151/Instructions!$C$33)*100","v":{"$error":"#VALUE!"}},"----","E","E","E","E","E","E","E","E","E","E","--",null,null,null,null,null,{"$f":"Table_2[[#This Row],[Column51]]&Table_2[[#This Row],[Column52]]&AW153","v":""}]
[151,null,null,null,null,null,null,null,null,null,null,null,null,null,null,null,null,null,null,null,"--",0,null,null,{"$f":"(K152/Instructions!$C$23)*100","v":0},{"$f":"(L152/Instructions!$C$24)*100","v":0},{"$f":"(M152/Instructions!$C$25)*100","v":0},{"$f":"(N152/Instructions!$C$26)*100","v":0},{"$f":"(O152/Instructions!$C$27)*100","v":0},{"$f":"(P152/Instructions!$C$28)*100","v":0},{"$f":"(Q152/Instructions!$C$29)*100","v":0},{"$f":"(R152/Instructions!$C$30)*100","v":0},{"$f":"(S152/Instructions!$C$31)*100","v":0},{"$f":"(T152/Instructions!$C$30)*100","v":0},{"$f":"(U152/Instructions!$C$33)*100","v":{"$error":"#VALUE!"}},"----","E","E","E","E","E","E","E","E","E","E","--",null,null,null,null,null,{"$f":"Table_2[[#This Row],[Column51]]&Table_2[[#This Row],[Column52]]&AW154","v":""}]
[152,null,null,null,null,null,null,null,null,null,null,null,null,null,null,null,null,null,null,null,"--",0,null,null,{"$f":"(K153/Instructions!$C$23)*100","v":0},{"$f":"(L153/Instructions!$C$24)*100","v":0},{"$f":"(M153/Instructions!$C$25)*100","v":0},{"$f":"(N153/Instructions!$C$26)*100","v":0},{"$f":"(O153/Instructions!$C$27)*100","v":0},{"$f":"(P153/Instructions!$C$28)*100","v":0},{"$f":"(Q153/Instructions!$C$29)*100","v":0},{"$f":"(R153/Instructions!$C$30)*100","v":0},{"$f":"(S153/Instructions!$C$31)*100","v":0},{"$f":"(T153/Instructions!$C$30)*100","v":0},{"$f":"(U153/Instructions!$C$33)*100","v":{"$error":"#VALUE!"}},"----","E","E","E","E","E","E","E","E","E","E","--",null,null,null,null,null,{"$f":"Table_2[[#This Row],[Column51]]&Table_2[[#This Row],[Column52]]&AW155","v":""}]
[153,null,null,null,null,null,null,null,null,null,null,null,null,null,null,null,null,null,null,null,"--",0,null,null,{"$f":"(K154/Instructions!$C$23)*100","v":0},{"$f":"(L154/Instructions!$C$24)*100","v":0},{"$f":"(M154/Instructions!$C$25)*100","v":0},{"$f":"(N154/Instructions!$C$26)*100","v":0},{"$f":"(O154/Instructions!$C$27)*100","v":0},{"$f":"(P154/Instructions!$C$28)*100","v":0},{"$f":"(Q154/Instructions!$C$29)*100","v":0},{"$f":"(R154/Instructions!$C$30)*100","v":0},{"$f":"(S154/Instructions!$C$31)*100","v":0},{"$f":"(T154/Instructions!$C$30)*100","v":0},{"$f":"(U154/Instructions!$C$33)*100","v":{"$error":"#VALUE!"}},"----","E","E","E","E","E","E","E","E","E","E","--",null,null,null,null,null,{"$f":"Table_2[[#This Row],[Column51]]&Table_2[[#This Row],[Column52]]&AW156","v":""}]
[154,null,null,null,null,null,null,null,null,null,null,null,null,null,null,null,null,null,null,null,"--",0,null,null,{"$f":"(K155/Instructions!$C$23)*100","v":0},{"$f":"(L155/Instructions!$C$24)*100","v":0},{"$f":"(M155/Instructions!$C$25)*100","v":0},{"$f":"(N155/Instructions!$C$26)*100","v":0},{"$f":"(O155/Instructions!$C$27)*100","v":0},{"$f":"(P155/Instructions!$C$28)*100","v":0},{"$f":"(Q155/Instructions!$C$29)*100","v":0},{"$f":"(R155/Instructions!$C$30)*100","v":0},{"$f":"(S155/Instructions!$C$31)*100","v":0},{"$f":"(T155/Instructions!$C$30)*100","v":0},{"$f":"(U155/Instructions!$C$33)*100","v":{"$error":"#VALUE!"}},"----","E","E","E","E","E","E","E","E","E","E","--",null,null,null,null,null,{"$f":"Table_2[[#This Row],[Column51]]&Table_2[[#This Row],[Column52]]&AW157","v":""}]
[155,null,null,null,null,null,null,null,null,null,null,null,null,null,null,null,null,null,null,null,"--",0,null,null,{"$f":"(K156/Instructions!$C$23)*100","v":0},{"$f":"(L156/Instructions!$C$24)*100","v":0},{"$f":"(M156/Instructions!$C$25)*100","v":0},{"$f":"(N156/Instructions!$C$26)*100","v":0},{"$f":"(O156/Instructions!$C$27)*100","v":0},{"$f":"(P156/Instructions!$C$28)*100","v":0},{"$f":"(Q156/Instructions!$C$29)*100","v":0},{"$f":"(R156/Instructions!$C$30)*100","v":0},{"$f":"(S156/Instructions!$C$31)*100","v":0},{"$f":"(T156/Instructions!$C$30)*100","v":0},{"$f":"(U156/Instructions!$C$33)*100","v":{"$error":"#VALUE!"}},"----","E","E","E","E","E","E","E","E","E","E","--",null,null,null,null,null,{"$f":"Table_2[[#This Row],[Column51]]&Table_2[[#This Row],[Column52]]&AW158","v":""}]
[156,null,null,null,null,null,null,null,null,null,null,null,null,null,null,null,null,null,null,null,"--",0,null,null,{"$f":"(K157/Instructions!$C$23)*100","v":0},{"$f":"(L157/Instructions!$C$24)*100","v":0},{"$f":"(M157/Instructions!$C$25)*100","v":0},{"$f":"(N157/Instructions!$C$26)*100","v":0},{"$f":"(O157/Instructions!$C$27)*100","v":0},{"$f":"(P157/Instructions!$C$28)*100","v":0},{"$f":"(Q157/Instructions!$C$29)*100","v":0},{"$f":"(R157/Instructions!$C$30)*100","v":0},{"$f":"(S157/Instructions!$C$31)*100","v":0},{"$f":"(T157/Instructions!$C$30)*100","v":0},{"$f":"(U157/Instructions!$C$33)*100","v":{"$error":"#VALUE!"}},"----","E","E","E","E","E","E","E","E","E","E","--",null,null,null,null,null,{"$f":"Table_2[[#This Row],[Column51]]&Table_2[[#This Row],[Column52]]&AW159","v":""}]
[157,null,null,null,null,null,null,null,null,null,null,null,null,null,null,null,null,null,null,null,"--",0,null,null,{"$f":"(K158/Instructions!$C$23)*100","v":0},{"$f":"(L158/Instructions!$C$24)*100","v":0},{"$f":"(M158/Instructions!$C$25)*100","v":0},{"$f":"(N158/Instructions!$C$26)*100","v":0},{"$f":"(O158/Instructions!$C$27)*100","v":0},{"$f":"(P158/Instructions!$C$28)*100","v":0},{"$f":"(Q158/Instructions!$C$29)*100","v":0},{"$f":"(R158/Instructions!$C$30)*100","v":0},{"$f":"(S158/Instructions!$C$31)*100","v":0},{"$f":"(T158/Instructions!$C$30)*100","v":0},{"$f":"(U158/Instructions!$C$33)*100","v":{"$error":"#VALUE!"}},"----","E","E","E","E","E","E","E","E","E","E","--",null,null,null,null,null,{"$f":"Table_2[[#This Row],[Column51]]&Table_2[[#This Row],[Column52]]&AW160","v":""}]
[158,null,null,null,null,null,null,null,null,null,null,null,null,null,null,null,null,null,null,null,"--",0,null,null,{"$f":"(K159/Instructions!$C$23)*100","v":0},{"$f":"(L159/Instructions!$C$24)*100","v":0},{"$f":"(M159/Instructions!$C$25)*100","v":0},{"$f":"(N159/Instructions!$C$26)*100","v":0},{"$f":"(O159/Instructions!$C$27)*100","v":0},{"$f":"(P159/Instructions!$C$28)*100","v":0},{"$f":"(Q159/Instructions!$C$29)*100","v":0},{"$f":"(R159/Instructions!$C$30)*100","v":0},{"$f":"(S159/Instructions!$C$31)*100","v":0},{"$f":"(T159/Instructions!$C$30)*100","v":0},{"$f":"(U159/Instructions!$C$33)*100","v":{"$error":"#VALUE!"}},"----","E","E","E","E","E","E","E","E","E","E","--",null,null,null,null,null,{"$f":"Table_2[[#This Row],[Column51]]&Table_2[[#This Row],[Column52]]&AW161","v":""}]
[159,null,null,null,null,null,null,null,null,null,null,null,null,null,null,null,null,null,null,null,"--",0,null,null,{"$f":"(K160/Instructions!$C$23)*100","v":0},{"$f":"(L160/Instructions!$C$24)*100","v":0},{"$f":"(M160/Instructions!$C$25)*100","v":0},{"$f":"(N160/Instructions!$C$26)*100","v":0},{"$f":"(O160/Instructions!$C$27)*100","v":0},{"$f":"(P160/Instructions!$C$28)*100","v":0},{"$f":"(Q160/Instructions!$C$29)*100","v":0},{"$f":"(R160/Instructions!$C$30)*100","v":0},{"$f":"(S160/Instructions!$C$31)*100","v":0},{"$f":"(T160/Instructions!$C$30)*100","v":0},{"$f":"(U160/Instructions!$C$33)*100","v":{"$error":"#VALUE!"}},"----","E","E","E","E","E","E","E","E","E","E","--",null,null,null,null,null,{"$f":"Table_2[[#This Row],[Column51]]&Table_2[[#This Row],[Column52]]&AW162","v":""}]
[160,null,null,null,null,null,null,null,null,null,null,null,null,null,null,null,null,null,null,null,"--",0,null,null,{"$f":"(K161/Instructions!$C$23)*100","v":0},{"$f":"(L161/Instructions!$C$24)*100","v":0},{"$f":"(M161/Instructions!$C$25)*100","v":0},{"$f":"(N161/Instructions!$C$26)*100","v":0},{"$f":"(O161/Instructions!$C$27)*100","v":0},{"$f":"(P161/Instructions!$C$28)*100","v":0},{"$f":"(Q161/Instructions!$C$29)*100","v":0},{"$f":"(R161/Instructions!$C$30)*100","v":0},{"$f":"(S161/Instructions!$C$31)*100","v":0},{"$f":"(T161/Instructions!$C$30)*100","v":0},{"$f":"(U161/Instructions!$C$33)*100","v":{"$error":"#VALUE!"}},"----","E","E","E","E","E","E","E","E","E","E","--",null,null,null,null,null,{"$f":"Table_2[[#This Row],[Column51]]&Table_2[[#This Row],[Column52]]&AW163","v":""}]
[161,null,null,null,null,null,null,null,null,null,null,null,null,null,null,null,null,null,null,null,"--",0,null,null,{"$f":"(K162/Instructions!$C$23)*100","v":0},{"$f":"(L162/Instructions!$C$24)*100","v":0},{"$f":"(M162/Instructions!$C$25)*100","v":0},{"$f":"(N162/Instructions!$C$26)*100","v":0},{"$f":"(O162/Instructions!$C$27)*100","v":0},{"$f":"(P162/Instructions!$C$28)*100","v":0},{"$f":"(Q162/Instructions!$C$29)*100","v":0},{"$f":"(R162/Instructions!$C$30)*100","v":0},{"$f":"(S162/Instructions!$C$31)*100","v":0},{"$f":"(T162/Instructions!$C$30)*100","v":0},{"$f":"(U162/Instructions!$C$33)*100","v":{"$error":"#VALUE!"}},"----","E","E","E","E","E","E","E","E","E","E","--",null,null,null,null,null,{"$f":"Table_2[[#This Row],[Column51]]&Table_2[[#This Row],[Column52]]&AW164","v":""}]
[162,null,null,null,null,null,null,null,null,null,null,null,null,null,null,null,null,null,null,null,"--",0,null,null,{"$f":"(K163/Instructions!$C$23)*100","v":0},{"$f":"(L163/Instructions!$C$24)*100","v":0},{"$f":"(M163/Instructions!$C$25)*100","v":0},{"$f":"(N163/Instructions!$C$26)*100","v":0},{"$f":"(O163/Instructions!$C$27)*100","v":0},{"$f":"(P163/Instructions!$C$28)*100","v":0},{"$f":"(Q163/Instructions!$C$29)*100","v":0},{"$f":"(R163/Instructions!$C$30)*100","v":0},{"$f":"(S163/Instructions!$C$31)*100","v":0},{"$f":"(T163/Instructions!$C$30)*100","v":0},{"$f":"(U163/Instructions!$C$33)*100","v":{"$error":"#VALUE!"}},"----","E","E","E","E","E","E","E","E","E","E","--",null,null,null,null,null,{"$f":"Table_2[[#This Row],[Column51]]&Table_2[[#This Row],[Column52]]&AW165","v":""}]
[163,null,null,null,null,null,null,null,null,null,null,null,null,null,null,null,null,null,null,null,"--",0,null,null,{"$f":"(K164/Instructions!$C$23)*100","v":0},{"$f":"(L164/Instructions!$C$24)*100","v":0},{"$f":"(M164/Instructions!$C$25)*100","v":0},{"$f":"(N164/Instructions!$C$26)*100","v":0},{"$f":"(O164/Instructions!$C$27)*100","v":0},{"$f":"(P164/Instructions!$C$28)*100","v":0},{"$f":"(Q164/Instructions!$C$29)*100","v":0},{"$f":"(R164/Instructions!$C$30)*100","v":0},{"$f":"(S164/Instructions!$C$31)*100","v":0},{"$f":"(T164/Instructions!$C$30)*100","v":0},{"$f":"(U164/Instructions!$C$33)*100","v":{"$error":"#VALUE!"}},"----","E","E","E","E","E","E","E","E","E","E","--",null,null,null,null,null,{"$f":"Table_2[[#This Row],[Column51]]&Table_2[[#This Row],[Column52]]&AW166","v":""}]
[164,null,null,null,null,null,null,null,null,null,null,null,null,null,null,null,null,null,null,null,"--",0,null,null,{"$f":"(K165/Instructions!$C$23)*100","v":0},{"$f":"(L165/Instructions!$C$24)*100","v":0},{"$f":"(M165/Instructions!$C$25)*100","v":0},{"$f":"(N165/Instructions!$C$26)*100","v":0},{"$f":"(O165/Instructions!$C$27)*100","v":0},{"$f":"(P165/Instructions!$C$28)*100","v":0},{"$f":"(Q165/Instructions!$C$29)*100","v":0},{"$f":"(R165/Instructions!$C$30)*100","v":0},{"$f":"(S165/Instructions!$C$31)*100","v":0},{"$f":"(T165/Instructions!$C$30)*100","v":0},{"$f":"(U165/Instructions!$C$33)*100","v":{"$error":"#VALUE!"}},"----","E","E","E","E","E","E","E","E","E","E","--",null,null,null,null,null,{"$f":"Table_2[[#This Row],[Column51]]&Table_2[[#This Row],[Column52]]&AW167","v":""}]
[165,null,null,null,null,null,null,null,null,null,null,null,null,null,null,null,null,null,null,null,"--",0,null,null,{"$f":"(K166/Instructions!$C$23)*100","v":0},{"$f":"(L166/Instructions!$C$24)*100","v":0},{"$f":"(M166/Instructions!$C$25)*100","v":0},{"$f":"(N166/Instructions!$C$26)*100","v":0},{"$f":"(O166/Instructions!$C$27)*100","v":0},{"$f":"(P166/Instructions!$C$28)*100","v":0},{"$f":"(Q166/Instructions!$C$29)*100","v":0},{"$f":"(R166/Instructions!$C$30)*100","v":0},{"$f":"(S166/Instructions!$C$31)*100","v":0},{"$f":"(T166/Instructions!$C$30)*100","v":0},{"$f":"(U166/Instructions!$C$33)*100","v":{"$error":"#VALUE!"}},"----","E","E","E","E","E","E","E","E","E","E","--",null,null,null,null,null,{"$f":"Table_2[[#This Row],[Column51]]&Table_2[[#This Row],[Column52]]&AW168","v":""}]
[166,null,null,null,null,null,null,null,null,null,null,null,null,null,null,null,null,null,null,null,"--",0,null,null,{"$f":"(K167/Instructions!$C$23)*100","v":0},{"$f":"(L167/Instructions!$C$24)*100","v":0},{"$f":"(M167/Instructions!$C$25)*100","v":0},{"$f":"(N167/Instructions!$C$26)*100","v":0},{"$f":"(O167/Instructions!$C$27)*100","v":0},{"$f":"(P167/Instructions!$C$28)*100","v":0},{"$f":"(Q167/Instructions!$C$29)*100","v":0},{"$f":"(R167/Instructions!$C$30)*100","v":0},{"$f":"(S167/Instructions!$C$31)*100","v":0},{"$f":"(T167/Instructions!$C$30)*100","v":0},{"$f":"(U167/Instructions!$C$33)*100","v":{"$error":"#VALUE!"}},"----","E","E","E","E","E","E","E","E","E","E","--",null,null,null,null,null,{"$f":"Table_2[[#This Row],[Column51]]&Table_2[[#This Row],[Column52]]&AW169","v":""}]
[167,null,null,null,null,null,null,null,null,null,null,null,null,null,null,null,null,null,null,null,"--",0,null,null,{"$f":"(K168/Instructions!$C$23)*100","v":0},{"$f":"(L168/Instructions!$C$24)*100","v":0},{"$f":"(M168/Instructions!$C$25)*100","v":0},{"$f":"(N168/Instructions!$C$26)*100","v":0},{"$f":"(O168/Instructions!$C$27)*100","v":0},{"$f":"(P168/Instructions!$C$28)*100","v":0},{"$f":"(Q168/Instructions!$C$29)*100","v":0},{"$f":"(R168/Instructions!$C$30)*100","v":0},{"$f":"(S168/Instructions!$C$31)*100","v":0},{"$f":"(T168/Instructions!$C$30)*100","v":0},{"$f":"(U168/Instructions!$C$33)*100","v":{"$error":"#VALUE!"}},"----","E","E","E","E","E","E","E","E","E","E","--",null,null,null,null,null,{"$f":"Table_2[[#This Row],[Column51]]&Table_2[[#This Row],[Column52]]&AW170","v":""}]
[168,null,null,null,null,null,null,null,null,null,null,null,null,null,null,null,null,null,null,null,"--",0,null,null,{"$f":"(K169/Instructions!$C$23)*100","v":0},{"$f":"(L169/Instructions!$C$24)*100","v":0},{"$f":"(M169/Instructions!$C$25)*100","v":0},{"$f":"(N169/Instructions!$C$26)*100","v":0},{"$f":"(O169/Instructions!$C$27)*100","v":0},{"$f":"(P169/Instructions!$C$28)*100","v":0},{"$f":"(Q169/Instructions!$C$29)*100","v":0},{"$f":"(R169/Instructions!$C$30)*100","v":0},{"$f":"(S169/Instructions!$C$31)*100","v":0},{"$f":"(T169/Instructions!$C$30)*100","v":0},{"$f":"(U169/Instructions!$C$33)*100","v":{"$error":"#VALUE!"}},"----","E","E","E","E","E","E","E","E","E","E","--",null,null,null,null,null,{"$f":"Table_2[[#This Row],[Column51]]&Table_2[[#This Row],[Column52]]&AW171","v":""}]
[169,null,null,null,null,null,null,null,null,null,null,null,null,null,null,null,null,null,null,null,"--",0,null,null,{"$f":"(K170/Instructions!$C$23)*100","v":0},{"$f":"(L170/Instructions!$C$24)*100","v":0},{"$f":"(M170/Instructions!$C$25)*100","v":0},{"$f":"(N170/Instructions!$C$26)*100","v":0},{"$f":"(O170/Instructions!$C$27)*100","v":0},{"$f":"(P170/Instructions!$C$28)*100","v":0},{"$f":"(Q170/Instructions!$C$29)*100","v":0},{"$f":"(R170/Instructions!$C$30)*100","v":0},{"$f":"(S170/Instructions!$C$31)*100","v":0},{"$f":"(T170/Instructions!$C$30)*100","v":0},{"$f":"(U170/Instructions!$C$33)*100","v":{"$error":"#VALUE!"}},"----","E","E","E","E","E","E","E","E","E","E","--",null,null,null,null,null,{"$f":"Table_2[[#This Row],[Column51]]&Table_2[[#This Row],[Column52]]&AW172","v":""}]
[170,null,null,null,null,null,null,null,null,null,null,null,null,null,null,null,null,null,null,null,"--",0,null,null,{"$f":"(K171/Instructions!$C$23)*100","v":0},{"$f":"(L171/Instructions!$C$24)*100","v":0},{"$f":"(M171/Instructions!$C$25)*100","v":0},{"$f":"(N171/Instructions!$C$26)*100","v":0},{"$f":"(O171/Instructions!$C$27)*100","v":0},{"$f":"(P171/Instructions!$C$28)*100","v":0},{"$f":"(Q171/Instructions!$C$29)*100","v":0},{"$f":"(R171/Instructions!$C$30)*100","v":0},{"$f":"(S171/Instructions!$C$31)*100","v":0},{"$f":"(T171/Instructions!$C$30)*100","v":0},{"$f":"(U171/Instructions!$C$33)*100","v":{"$error":"#VALUE!"}},"----","E","E","E","E","E","E","E","E","E","E","--",null,null,null,null,null,{"$f":"Table_2[[#This Row],[Column51]]&Table_2[[#This Row],[Column52]]&AW173","v":""}]
[171,null,null,null,null,null,null,null,null,null,null,null,null,null,null,null,null,null,null,null,"--",0,null,null,{"$f":"(K172/Instructions!$C$23)*100","v":0},{"$f":"(L172/Instructions!$C$24)*100","v":0},{"$f":"(M172/Instructions!$C$25)*100","v":0},{"$f":"(N172/Instructions!$C$26)*100","v":0},{"$f":"(O172/Instructions!$C$27)*100","v":0},{"$f":"(P172/Instructions!$C$28)*100","v":0},{"$f":"(Q172/Instructions!$C$29)*100","v":0},{"$f":"(R172/Instructions!$C$30)*100","v":0},{"$f":"(S172/Instructions!$C$31)*100","v":0},{"$f":"(T172/Instructions!$C$30)*100","v":0},{"$f":"(U172/Instructions!$C$33)*100","v":{"$error":"#VALUE!"}},"----","E","E","E","E","E","E","E","E","E","E","--",null,null,null,null,null,{"$f":"Table_2[[#This Row],[Column51]]&Table_2[[#This Row],[Column52]]&AW174","v":""}]
[172,null,null,null,null,null,null,null,null,null,null,null,null,null,null,null,null,null,null,null,"--",0,null,null,{"$f":"(K173/Instructions!$C$23)*100","v":0},{"$f":"(L173/Instructions!$C$24)*100","v":0},{"$f":"(M173/Instructions!$C$25)*100","v":0},{"$f":"(N173/Instructions!$C$26)*100","v":0},{"$f":"(O173/Instructions!$C$27)*100","v":0},{"$f":"(P173/Instructions!$C$28)*100","v":0},{"$f":"(Q173/Instructions!$C$29)*100","v":0},{"$f":"(R173/Instructions!$C$30)*100","v":0},{"$f":"(S173/Instructions!$C$31)*100","v":0},{"$f":"(T173/Instructions!$C$30)*100","v":0},{"$f":"(U173/Instructions!$C$33)*100","v":{"$error":"#VALUE!"}},"----","E","E","E","E","E","E","E","E","E","E","--",null,null,null,null,null,{"$f":"Table_2[[#This Row],[Column51]]&Table_2[[#This Row],[Column52]]&AW175","v":""}]
[173,null,null,null,null,null,null,null,null,null,null,null,null,null,null,null,null,null,null,null,"--",0,null,null,{"$f":"(K174/Instructions!$C$23)*100","v":0},{"$f":"(L174/Instructions!$C$24)*100","v":0},{"$f":"(M174/Instructions!$C$25)*100","v":0},{"$f":"(N174/Instructions!$C$26)*100","v":0},{"$f":"(O174/Instructions!$C$27)*100","v":0},{"$f":"(P174/Instructions!$C$28)*100","v":0},{"$f":"(Q174/Instructions!$C$29)*100","v":0},{"$f":"(R174/Instructions!$C$30)*100","v":0},{"$f":"(S174/Instructions!$C$31)*100","v":0},{"$f":"(T174/Instructions!$C$30)*100","v":0},{"$f":"(U174/Instructions!$C$33)*100","v":{"$error":"#VALUE!"}},"----","E","E","E","E","E","E","E","E","E","E","--",null,null,null,null,null,{"$f":"Table_2[[#This Row],[Column51]]&Table_2[[#This Row],[Column52]]&AW176","v":""}]
[174,null,null,null,null,null,null,null,null,null,null,null,null,null,null,null,null,null,null,null,"--",0,null,null,{"$f":"(K175/Instructions!$C$23)*100","v":0},{"$f":"(L175/Instructions!$C$24)*100","v":0},{"$f":"(M175/Instructions!$C$25)*100","v":0},{"$f":"(N175/Instructions!$C$26)*100","v":0},{"$f":"(O175/Instructions!$C$27)*100","v":0},{"$f":"(P175/Instructions!$C$28)*100","v":0},{"$f":"(Q175/Instructions!$C$29)*100","v":0},{"$f":"(R175/Instructions!$C$30)*100","v":0},{"$f":"(S175/Instructions!$C$31)*100","v":0},{"$f":"(T175/Instructions!$C$30)*100","v":0},{"$f":"(U175/Instructions!$C$33)*100","v":{"$error":"#VALUE!"}},"----","E","E","E","E","E","E","E","E","E","E","--",null,null,null,null,null,{"$f":"Table_2[[#This Row],[Column51]]&Table_2[[#This Row],[Column52]]&AW177","v":""}]
[175,null,null,null,null,null,null,null,null,null,null,null,null,null,null,null,null,null,null,null,"--",0,null,null,{"$f":"(K176/Instructions!$C$23)*100","v":0},{"$f":"(L176/Instructions!$C$24)*100","v":0},{"$f":"(M176/Instructions!$C$25)*100","v":0},{"$f":"(N176/Instructions!$C$26)*100","v":0},{"$f":"(O176/Instructions!$C$27)*100","v":0},{"$f":"(P176/Instructions!$C$28)*100","v":0},{"$f":"(Q176/Instructions!$C$29)*100","v":0},{"$f":"(R176/Instructions!$C$30)*100","v":0},{"$f":"(S176/Instructions!$C$31)*100","v":0},{"$f":"(T176/Instructions!$C$30)*100","v":0},{"$f":"(U176/Instructions!$C$33)*100","v":{"$error":"#VALUE!"}},"----","E","E","E","E","E","E","E","E","E","E","--",null,null,null,null,null,{"$f":"Table_2[[#This Row],[Column51]]&Table_2[[#This Row],[Column52]]&AW178","v":""}]
[176,null,null,null,null,null,null,null,null,null,null,null,null,null,null,null,null,null,null,null,"--",0,null,null,{"$f":"(K177/Instructions!$C$23)*100","v":0},{"$f":"(L177/Instructions!$C$24)*100","v":0},{"$f":"(M177/Instructions!$C$25)*100","v":0},{"$f":"(N177/Instructions!$C$26)*100","v":0},{"$f":"(O177/Instructions!$C$27)*100","v":0},{"$f":"(P177/Instructions!$C$28)*100","v":0},{"$f":"(Q177/Instructions!$C$29)*100","v":0},{"$f":"(R177/Instructions!$C$30)*100","v":0},{"$f":"(S177/Instructions!$C$31)*100","v":0},{"$f":"(T177/Instructions!$C$30)*100","v":0},{"$f":"(U177/Instructions!$C$33)*100","v":{"$error":"#VALUE!"}},"----","E","E","E","E","E","E","E","E","E","E","--",null,null,null,null,null,{"$f":"Table_2[[#This Row],[Column51]]&Table_2[[#This Row],[Column52]]&AW179","v":""}]
[177,null,null,null,null,null,null,null,null,null,null,null,null,null,null,null,null,null,null,null,"--",0,null,null,{"$f":"(K178/Instructions!$C$23)*100","v":0},{"$f":"(L178/Instructions!$C$24)*100","v":0},{"$f":"(M178/Instructions!$C$25)*100","v":0},{"$f":"(N178/Instructions!$C$26)*100","v":0},{"$f":"(O178/Instructions!$C$27)*100","v":0},{"$f":"(P178/Instructions!$C$28)*100","v":0},{"$f":"(Q178/Instructions!$C$29)*100","v":0},{"$f":"(R178/Instructions!$C$30)*100","v":0},{"$f":"(S178/Instructions!$C$31)*100","v":0},{"$f":"(T178/Instructions!$C$30)*100","v":0},{"$f":"(U178/Instructions!$C$33)*100","v":{"$error":"#VALUE!"}},"----","E","E","E","E","E","E","E","E","E","E","--",null,null,null,null,null,{"$f":"Table_2[[#This Row],[Column51]]&Table_2[[#This Row],[Column52]]&AW180","v":""}]
[178,null,null,null,null,null,null,null,null,null,null,null,null,null,null,null,null,null,null,null,"--",0,null,null,{"$f":"(K179/Instructions!$C$23)*100","v":0},{"$f":"(L179/Instructions!$C$24)*100","v":0},{"$f":"(M179/Instructions!$C$25)*100","v":0},{"$f":"(N179/Instructions!$C$26)*100","v":0},{"$f":"(O179/Instructions!$C$27)*100","v":0},{"$f":"(P179/Instructions!$C$28)*100","v":0},{"$f":"(Q179/Instructions!$C$29)*100","v":0},{"$f":"(R179/Instructions!$C$30)*100","v":0},{"$f":"(S179/Instructions!$C$31)*100","v":0},{"$f":"(T179/Instructions!$C$30)*100","v":0},{"$f":"(U179/Instructions!$C$33)*100","v":{"$error":"#VALUE!"}},{"$f":"IF(AND(Y179>=33,Z179>=33,AA179>=33,AB179>=33,AC179>=33,AD179>=33),\"PASS\",\"----\")","v":"----"},"E","E","E","E","E","E","E","E","E","E","--",null,null,null,null,null,{"$f":"Table_2[[#This Row],[Column51]]&Table_2[[#This Row],[Column52]]&AW181","v":""}]
[179,null,null,null,null,null,null,null,null,null,null,null,null,null,null,null,null,null,null,null,"--",0,null,null,{"$f":"(K180/Instructions!$C$23)*100","v":0},{"$f":"(L180/Instructions!$C$24)*100","v":0},{"$f":"(M180/Instructions!$C$25)*100","v":0},{"$f":"(N180/Instructions!$C$26)*100","v":0},{"$f":"(O180/Instructions!$C$27)*100","v":0},{"$f":"(P180/Instructions!$C$28)*100","v":0},{"$f":"(Q180/Instructions!$C$29)*100","v":0},{"$f":"(R180/Instructions!$C$30)*100","v":0},{"$f":"(S180/Instructions!$C$31)*100","v":0},{"$f":"(T180/Instructions!$C$30)*100","v":0},{"$f":"(U180/Instructions!$C$33)*100","v":{"$error":"#VALUE!"}},"----",{"$f":"IFERROR(IF(Y180>90,\"A+\",IF(Y180>80,\"A\",IF(Y180>70,\"B+\",IF(Y180>60,\"B\",IF(Y180>50,\"C+\",IF(Y180>40,\"C\",IF(Y180>=33,\"D\",\"E\"))))))),\"Abs\")","v":"E"},{"$f":"IFERROR(IF(Z180>90,\"A+\",IF(Z180>80,\"A\",IF(Z180>70,\"B+\",IF(Z180>60,\"B\",IF(Z180>50,\"C+\",IF(Z180>40,\"C\",IF(Z180>=33,\"D\",\"E\"))))))),\"Abs\")","v":"E"},{"$f":"IFERROR(IF(AA180>90,\"A+\",IF(AA180>80,\"A\",IF(AA180>70,\"B+\",IF(AA180>60,\"B\",IF(AA180>50,\"C+\",IF(AA180>40,\"C\",IF(AA180>=33,\"D\",\"E\"))))))),\"Abs\")","v":"E"},{"$f":"IFERROR(IF(AB180>90,\"A+\",IF(AB180>80,\"A\",IF(AB180>70,\"B+\",IF(AB180>60,\"B\",IF(AB180>50,\"C+\",IF(AB180>40,\"C\",IF(AB180>=33,\"D\",\"E\"))))))),\"Abs\")","v":"E"},{"$f":"IFERROR(IF(AC180>90,\"A+\",IF(AC180>80,\"A\",IF(AC180>70,\"B+\",IF(AC180>60,\"B\",IF(AC180>50,\"C+\",IF(AC180>40,\"C\",IF(AC180>=33,\"D\",\"E\"))))))),\"Abs\")","v":"E"},{"$f":"IFERROR(IF(AD180>90,\"A+\",IF(AD180>80,\"A\",IF(AD180>70,\"B+\",IF(AD180>60,\"B\",IF(AD180>50,\"C+\",IF(AD180>40,\"C\",IF(AD180>=33,\"D\",\"E\"))))))),\"Abs\")","v":"E"},{"$f":"IFERROR(IF(AE180>90,\"A+\",IF(AE180>80,\"A\",IF(AE180>70,\"B+\",IF(AE180>60,\"B\",IF(AE180>50,\"C+\",IF(AE180>40,\"C\",IF(AE180>=33,\"D\",\"E\"))))))),\"Abs\")","v":"E"},{"$f":"IFERROR(IF(AF180>90,\"A+\",IF(AF180>80,\"A\",IF(AF180>70,\"B+\",IF(AF180>60,\"B\",IF(AF180>50,\"C+\",IF(AF180>40,\"C\",IF(AF180>=33,\"D\",\"E\"))))))),\"Abs\")","v":"E"},{"$f":"IFERROR(IF(AG180>90,\"A+\",IF(AG180>80,\"A\",IF(AG180>70,\"B+\",IF(AG180>60,\"B\",IF(AG180>50,\"C+\",IF(AG180>40,\"C\",IF(AG180>=33,\"D\",\"E\"))))))),\"Abs\")","v":"E"},{"$f":"IFERROR(IF(AH180>90,\"A+\",IF(AH180>80,\"A\",IF(AH180>70,\"B+\",IF(AH180>60,\"B\",IF(AH180>50,\"C+\",IF(AH180>40,\"C\",IF(AH180>=33,\"D\",\"E\"))))))),\"Abs\")","v":"E"},"--",null,null,null,null,null,{"$f":"Table_2[[#This Row],[Column51]]&Table_2[[#This Row],[Column52]]&AW182","v":""}]
[180,null,null,null,null,null,null,null,null,null,null,null,null,null,null,null,null,null,null,null,"--",0,null,null,{"$f":"(K181/Instructions!$C$23)*100","v":0},{"$f":"(L181/Instructions!$C$24)*100","v":0},{"$f":"(M181/Instructions!$C$25)*100","v":0},{"$f":"(N181/Instructions!$C$26)*100","v":0},{"$f":"(O181/Instructions!$C$27)*100","v":0},{"$f":"(P181/Instructions!$C$28)*100","v":0},{"$f":"(Q181/Instructions!$C$29)*100","v":0},{"$f":"(R181/Instructions!$C$30)*100","v":0},{"$f":"(S181/Instructions!$C$31)*100","v":0},{"$f":"(T181/Instructions!$C$30)*100","v":0},{"$f":"(U181/Instructions!$C$33)*100","v":{"$error":"#VALUE!"}},"----","E","E","E","E","E","E","E","E","E","E","--",null,null,null,null,null,{"$f":"Table_2[[#This Row],[Column51]]&Table_2[[#This Row],[Column52]]&AW183","v":""}]
[181,null,null,null,null,null,null,null,null,null,null,null,null,null,null,null,null,null,null,null,"--",0,null,null,{"$f":"(K182/Instructions!$C$23)*100","v":0},{"$f":"(L182/Instructions!$C$24)*100","v":0},{"$f":"(M182/Instructions!$C$25)*100","v":0},{"$f":"(N182/Instructions!$C$26)*100","v":0},{"$f":"(O182/Instructions!$C$27)*100","v":0},{"$f":"(P182/Instructions!$C$28)*100","v":0},{"$f":"(Q182/Instructions!$C$29)*100","v":0},{"$f":"(R182/Instructions!$C$30)*100","v":0},{"$f":"(S182/Instructions!$C$31)*100","v":0},{"$f":"(T182/Instructions!$C$30)*100","v":0},{"$f":"(U182/Instructions!$C$33)*100","v":{"$error":"#VALUE!"}},"----","E","E","E","E","E","E","E","E","E","E","--",null,null,null,null,null,{"$f":"Table_2[[#This Row],[Column51]]&Table_2[[#This Row],[Column52]]&AW184","v":""}]
[182,null,null,null,null,null,null,null,null,null,null,null,null,null,null,null,null,null,null,null,"--",0,null,null,{"$f":"(K183/Instructions!$C$23)*100","v":0},{"$f":"(L183/Instructions!$C$24)*100","v":0},{"$f":"(M183/Instructions!$C$25)*100","v":0},{"$f":"(N183/Instructions!$C$26)*100","v":0},{"$f":"(O183/Instructions!$C$27)*100","v":0},{"$f":"(P183/Instructions!$C$28)*100","v":0},{"$f":"(Q183/Instructions!$C$29)*100","v":0},{"$f":"(R183/Instructions!$C$30)*100","v":0},{"$f":"(S183/Instructions!$C$31)*100","v":0},{"$f":"(T183/Instructions!$C$30)*100","v":0},{"$f":"(U183/Instructions!$C$33)*100","v":{"$error":"#VALUE!"}},"----","E","E","E","E","E","E","E","E","E","E","--",null,null,null,null,null,{"$f":"Table_2[[#This Row],[Column51]]&Table_2[[#This Row],[Column52]]&AW185","v":""}]
[183,null,null,null,null,null,null,null,null,null,null,null,null,null,null,null,null,null,null,null,"--",0,null,null,{"$f":"(K184/Instructions!$C$23)*100","v":0},{"$f":"(L184/Instructions!$C$24)*100","v":0},{"$f":"(M184/Instructions!$C$25)*100","v":0},{"$f":"(N184/Instructions!$C$26)*100","v":0},{"$f":"(O184/Instructions!$C$27)*100","v":0},{"$f":"(P184/Instructions!$C$28)*100","v":0},{"$f":"(Q184/Instructions!$C$29)*100","v":0},{"$f":"(R184/Instructions!$C$30)*100","v":0},{"$f":"(S184/Instructions!$C$31)*100","v":0},{"$f":"(T184/Instructions!$C$30)*100","v":0},{"$f":"(U184/Instructions!$C$33)*100","v":{"$error":"#VALUE!"}},"----","E","E","E","E","E","E","E","E","E","E","--",null,null,null,null,null,{"$f":"Table_2[[#This Row],[Column51]]&Table_2[[#This Row],[Column52]]&AW186","v":""}]
[184,null,null,null,null,null,null,null,null,null,null,null,null,null,null,null,null,null,null,null,"--",0,null,null,{"$f":"(K185/Instructions!$C$23)*100","v":0},{"$f":"(L185/Instructions!$C$24)*100","v":0},{"$f":"(M185/Instructions!$C$25)*100","v":0},{"$f":"(N185/Instructions!$C$26)*100","v":0},{"$f":"(O185/Instructions!$C$27)*100","v":0},{"$f":"(P185/Instructions!$C$28)*100","v":0},{"$f":"(Q185/Instructions!$C$29)*100","v":0},{"$f":"(R185/Instructions!$C$30)*100","v":0},{"$f":"(S185/Instructions!$C$31)*100","v":0},{"$f":"(T185/Instructions!$C$30)*100","v":0},{"$f":"(U185/Instructions!$C$33)*100","v":{"$error":"#VALUE!"}},"----","E","E","E","E","E","E","E","E","E","E","--",null,null,null,null,null,{"$f":"Table_2[[#This Row],[Column51]]&Table_2[[#This Row],[Column52]]&AW187","v":""}]
[185,null,null,null,null,null,null,null,null,null,null,null,null,null,null,null,null,null,null,null,"--",0,null,null,{"$f":"(K186/Instructions!$C$23)*100","v":0},{"$f":"(L186/Instructions!$C$24)*100","v":0},{"$f":"(M186/Instructions!$C$25)*100","v":0},{"$f":"(N186/Instructions!$C$26)*100","v":0},{"$f":"(O186/Instructions!$C$27)*100","v":0},{"$f":"(P186/Instructions!$C$28)*100","v":0},{"$f":"(Q186/Instructions!$C$29)*100","v":0},{"$f":"(R186/Instructions!$C$30)*100","v":0},{"$f":"(S186/Instructions!$C$31)*100","v":0},{"$f":"(T186/Instructions!$C$30)*100","v":0},{"$f":"(U186/Instructions!$C$33)*100","v":{"$error":"#VALUE!"}},"----","E","E","E","E","E","E","E","E","E","E","--",null,null,null,null,null,{"$f":"Table_2[[#This Row],[Column51]]&Table_2[[#This Row],[Column52]]&AW188","v":""}]
[186,null,null,null,null,null,null,null,null,null,null,null,null,null,null,null,null,null,null,null,"--",0,null,null,{"$f":"(K187/Instructions!$C$23)*100","v":0},{"$f":"(L187/Instructions!$C$24)*100","v":0},{"$f":"(M187/Instructions!$C$25)*100","v":0},{"$f":"(N187/Instructions!$C$26)*100","v":0},{"$f":"(O187/Instructions!$C$27)*100","v":0},{"$f":"(P187/Instructions!$C$28)*100","v":0},{"$f":"(Q187/Instructions!$C$29)*100","v":0},{"$f":"(R187/Instructions!$C$30)*100","v":0},{"$f":"(S187/Instructions!$C$31)*100","v":0},{"$f":"(T187/Instructions!$C$30)*100","v":0},{"$f":"(U187/Instructions!$C$33)*100","v":{"$error":"#VALUE!"}},"----","E","E","E","E","E","E","E","E","E","E","--",null,null,null,null,null,{"$f":"Table_2[[#This Row],[Column51]]&Table_2[[#This Row],[Column52]]&AW189","v":""}]
[187,null,null,null,null,null,null,null,null,null,null,null,null,null,null,null,null,null,null,null,"--",0,null,null,{"$f":"(K188/Instructions!$C$23)*100","v":0},{"$f":"(L188/Instructions!$C$24)*100","v":0},{"$f":"(M188/Instructions!$C$25)*100","v":0},{"$f":"(N188/Instructions!$C$26)*100","v":0},{"$f":"(O188/Instructions!$C$27)*100","v":0},{"$f":"(P188/Instructions!$C$28)*100","v":0},{"$f":"(Q188/Instructions!$C$29)*100","v":0},{"$f":"(R188/Instructions!$C$30)*100","v":0},{"$f":"(S188/Instructions!$C$31)*100","v":0},{"$f":"(T188/Instructions!$C$30)*100","v":0},{"$f":"(U188/Instructions!$C$33)*100","v":{"$error":"#VALUE!"}},"----","E","E","E","E","E","E","E","E","E","E","--",null,null,null,null,null,{"$f":"Table_2[[#This Row],[Column51]]&Table_2[[#This Row],[Column52]]&AW190","v":""}]
[188,null,null,null,null,null,null,null,null,null,null,null,null,null,null,null,null,null,null,null,"--",0,null,null,{"$f":"(K189/Instructions!$C$23)*100","v":0},{"$f":"(L189/Instructions!$C$24)*100","v":0},{"$f":"(M189/Instructions!$C$25)*100","v":0},{"$f":"(N189/Instructions!$C$26)*100","v":0},{"$f":"(O189/Instructions!$C$27)*100","v":0},{"$f":"(P189/Instructions!$C$28)*100","v":0},{"$f":"(Q189/Instructions!$C$29)*100","v":0},{"$f":"(R189/Instructions!$C$30)*100","v":0},{"$f":"(S189/Instructions!$C$31)*100","v":0},{"$f":"(T189/Instructions!$C$30)*100","v":0},{"$f":"(U189/Instructions!$C$33)*100","v":{"$error":"#VALUE!"}},"----","E","E","E","E","E","E","E","E","E","E","--",null,null,null,null,null,{"$f":"Table_2[[#This Row],[Column51]]&Table_2[[#This Row],[Column52]]&AW191","v":""}]
[189,null,null,null,null,null,null,null,null,null,null,null,null,null,null,null,null,null,null,null,"--",0,null,null,{"$f":"(K190/Instructions!$C$23)*100","v":0},{"$f":"(L190/Instructions!$C$24)*100","v":0},{"$f":"(M190/Instructions!$C$25)*100","v":0},{"$f":"(N190/Instructions!$C$26)*100","v":0},{"$f":"(O190/Instructions!$C$27)*100","v":0},{"$f":"(P190/Instructions!$C$28)*100","v":0},{"$f":"(Q190/Instructions!$C$29)*100","v":0},{"$f":"(R190/Instructions!$C$30)*100","v":0},{"$f":"(S190/Instructions!$C$31)*100","v":0},{"$f":"(T190/Instructions!$C$30)*100","v":0},{"$f":"(U190/Instructions!$C$33)*100","v":{"$error":"#VALUE!"}},"----","E","E","E","E","E","E","E","E","E","E","--",null,null,null,null,null,{"$f":"Table_2[[#This Row],[Column51]]&Table_2[[#This Row],[Column52]]&AW192","v":""}]
[190,null,null,null,null,null,null,null,null,null,null,null,null,null,null,null,null,null,null,null,"--",0,null,null,{"$f":"(K191/Instructions!$C$23)*100","v":0},{"$f":"(L191/Instructions!$C$24)*100","v":0},{"$f":"(M191/Instructions!$C$25)*100","v":0},{"$f":"(N191/Instructions!$C$26)*100","v":0},{"$f":"(O191/Instructions!$C$27)*100","v":0},{"$f":"(P191/Instructions!$C$28)*100","v":0},{"$f":"(Q191/Instructions!$C$29)*100","v":0},{"$f":"(R191/Instructions!$C$30)*100","v":0},{"$f":"(S191/Instructions!$C$31)*100","v":0},{"$f":"(T191/Instructions!$C$30)*100","v":0},{"$f":"(U191/Instructions!$C$33)*100","v":{"$error":"#VALUE!"}},"----","E","E","E","E","E","E","E","E","E","E","--",null,null,null,null,null,{"$f":"Table_2[[#This Row],[Column51]]&Table_2[[#This Row],[Column52]]&AW193","v":""}]
[191,null,null,null,null,null,null,null,null,null,null,null,null,null,null,null,null,null,null,null,"--",0,null,null,{"$f":"(K192/Instructions!$C$23)*100","v":0},{"$f":"(L192/Instructions!$C$24)*100","v":0},{"$f":"(M192/Instructions!$C$25)*100","v":0},{"$f":"(N192/Instructions!$C$26)*100","v":0},{"$f":"(O192/Instructions!$C$27)*100","v":0},{"$f":"(P192/Instructions!$C$28)*100","v":0},{"$f":"(Q192/Instructions!$C$29)*100","v":0},{"$f":"(R192/Instructions!$C$30)*100","v":0},{"$f":"(S192/Instructions!$C$31)*100","v":0},{"$f":"(T192/Instructions!$C$30)*100","v":0},{"$f":"(U192/Instructions!$C$33)*100","v":{"$error":"#VALUE!"}},"----","E","E","E","E","E","E","E","E","E","E","--",null,null,null,null,null,{"$f":"Table_2[[#This Row],[Column51]]&Table_2[[#This Row],[Column52]]&AW194","v":""}]
[192,null,null,null,null,null,null,null,null,null,null,null,null,null,null,null,null,null,null,null,"--",0,null,null,{"$f":"(K193/Instructions!$C$23)*100","v":0},{"$f":"(L193/Instructions!$C$24)*100","v":0},{"$f":"(M193/Instructions!$C$25)*100","v":0},{"$f":"(N193/Instructions!$C$26)*100","v":0},{"$f":"(O193/Instructions!$C$27)*100","v":0},{"$f":"(P193/Instructions!$C$28)*100","v":0},{"$f":"(Q193/Instructions!$C$29)*100","v":0},{"$f":"(R193/Instructions!$C$30)*100","v":0},{"$f":"(S193/Instructions!$C$31)*100","v":0},{"$f":"(T193/Instructions!$C$30)*100","v":0},{"$f":"(U193/Instructions!$C$33)*100","v":{"$error":"#VALUE!"}},"----","E","E","E","E","E","E","E","E","E","E","--",null,null,null,null,null,{"$f":"Table_2[[#This Row],[Column51]]&Table_2[[#This Row],[Column52]]&AW195","v":""}]
[193,null,null,null,null,null,null,null,null,null,null,null,null,null,null,null,null,null,null,null,"--",0,null,null,{"$f":"(K194/Instructions!$C$23)*100","v":0},{"$f":"(L194/Instructions!$C$24)*100","v":0},{"$f":"(M194/Instructions!$C$25)*100","v":0},{"$f":"(N194/Instructions!$C$26)*100","v":0},{"$f":"(O194/Instructions!$C$27)*100","v":0},{"$f":"(P194/Instructions!$C$28)*100","v":0},{"$f":"(Q194/Instructions!$C$29)*100","v":0},{"$f":"(R194/Instructions!$C$30)*100","v":0},{"$f":"(S194/Instructions!$C$31)*100","v":0},{"$f":"(T194/Instructions!$C$30)*100","v":0},{"$f":"(U194/Instructions!$C$33)*100","v":{"$error":"#VALUE!"}},"----","E","E","E","E","E","E","E","E","E","E","--",null,null,null,null,null,{"$f":"Table_2[[#This Row],[Column51]]&Table_2[[#This Row],[Column52]]&AW196","v":""}]
[194,null,null,null,null,null,null,null,null,null,null,null,null,null,null,null,null,null,null,null,{"$f":"IF(MIN(Y195:AD195)>=33,SUM(K195:P195),\"--\")","v":"--"},{"$f":"IF(U195=\"--\",0,U195)","v":0},null,null,{"$f":"(K195/Instructions!$C$23)*100","v":0},{"$f":"(L195/Instructions!$C$24)*100","v":0},{"$f":"(M195/Instructions!$C$25)*100","v":0},{"$f":"(N195/Instructions!$C$26)*100","v":0},{"$f":"(O195/Instructions!$C$27)*100","v":0},{"$f":"(P195/Instructions!$C$28)*100","v":0},{"$f":"(Q195/Instructions!$C$29)*100","v":0},{"$f":"(R195/Instructions!$C$30)*100","v":0},{"$f":"(S195/Instructions!$C$31)*100","v":0},{"$f":"(T195/Instructions!$C$30)*100","v":0},{"$f":"(U195/Instructions!$C$33)*100","v":{"$error":"#VALUE!"}},"----","E","E","E","E","E","E","E","E","E","E",{"$f":"IFERROR(IF(AI195>90,\"A+\",IF(AI195>80,\"A\",IF(AI195>70,\"B+\",IF(AI195>60,\"B\",IF(AI195>50,\"C+\",IF(AI195>40,\"C\",IF(AI195>=33,\"D\",\"E\"))))))),\"--\")","v":"--"},null,null,null,null,null,{"$f":"Table_2[[#This Row],[Column51]]&Table_2[[#This Row],[Column52]]&AW197","v":""}]
[195,null,null,null,null,null,null,null,null,null,null,null,null,null,null,null,null,null,null,null,"--",0,null,null,{"$f":"(K196/Instructions!$C$23)*100","v":0},{"$f":"(L196/Instructions!$C$24)*100","v":0},{"$f":"(M196/Instructions!$C$25)*100","v":0},{"$f":"(N196/Instructions!$C$26)*100","v":0},{"$f":"(O196/Instructions!$C$27)*100","v":0},{"$f":"(P196/Instructions!$C$28)*100","v":0},{"$f":"(Q196/Instructions!$C$29)*100","v":0},{"$f":"(R196/Instructions!$C$30)*100","v":0},{"$f":"(S196/Instructions!$C$31)*100","v":0},{"$f":"(T196/Instructions!$C$30)*100","v":0},{"$f":"(U196/Instructions!$C$33)*100","v":{"$error":"#VALUE!"}},"----","E","E","E","E","E","E","E","E","E","E","--",null,null,null,null,null,{"$f":"Table_2[[#This Row],[Column51]]&Table_2[[#This Row],[Column52]]&AW198","v":""}]
[196,null,null,null,null,null,null,null,null,null,null,null,null,null,null,null,null,null,null,null,"--",0,null,null,{"$f":"(K197/Instructions!$C$23)*100","v":0},{"$f":"(L197/Instructions!$C$24)*100","v":0},{"$f":"(M197/Instructions!$C$25)*100","v":0},{"$f":"(N197/Instructions!$C$26)*100","v":0},{"$f":"(O197/Instructions!$C$27)*100","v":0},{"$f":"(P197/Instructions!$C$28)*100","v":0},{"$f":"(Q197/Instructions!$C$29)*100","v":0},{"$f":"(R197/Instructions!$C$30)*100","v":0},{"$f":"(S197/Instructions!$C$31)*100","v":0},{"$f":"(T197/Instructions!$C$30)*100","v":0},{"$f":"(U197/Instructions!$C$33)*100","v":{"$error":"#VALUE!"}},"----","E","E","E","E","E","E","E","E","E","E","--",null,null,null,null,null,{"$f":"Table_2[[#This Row],[Column51]]&Table_2[[#This Row],[Column52]]&AW199","v":""}]
[197,null,null,null,null,null,null,null,null,null,null,null,null,null,null,null,null,null,null,null,"--",0,null,null,{"$f":"(K198/Instructions!$C$23)*100","v":0},{"$f":"(L198/Instructions!$C$24)*100","v":0},{"$f":"(M198/Instructions!$C$25)*100","v":0},{"$f":"(N198/Instructions!$C$26)*100","v":0},{"$f":"(O198/Instructions!$C$27)*100","v":0},{"$f":"(P198/Instructions!$C$28)*100","v":0},{"$f":"(Q198/Instructions!$C$29)*100","v":0},{"$f":"(R198/Instructions!$C$30)*100","v":0},{"$f":"(S198/Instructions!$C$31)*100","v":0},{"$f":"(T198/Instructions!$C$30)*100","v":0},{"$f":"(U198/Instructions!$C$33)*100","v":{"$error":"#VALUE!"}},"----","E","E","E","E","E","E","E","E","E","E","--",null,null,null,null,null,{"$f":"Table_2[[#This Row],[Column51]]&Table_2[[#This Row],[Column52]]&AW200","v":""}]
[198,null,null,null,null,null,null,null,null,null,null,null,null,null,null,null,null,null,null,null,"--",0,null,null,{"$f":"(K199/Instructions!$C$23)*100","v":0},{"$f":"(L199/Instructions!$C$24)*100","v":0},{"$f":"(M199/Instructions!$C$25)*100","v":0},{"$f":"(N199/Instructions!$C$26)*100","v":0},{"$f":"(O199/Instructions!$C$27)*100","v":0},{"$f":"(P199/Instructions!$C$28)*100","v":0},{"$f":"(Q199/Instructions!$C$29)*100","v":0},{"$f":"(R199/Instructions!$C$30)*100","v":0},{"$f":"(S199/Instructions!$C$31)*100","v":0},{"$f":"(T199/Instructions!$C$30)*100","v":0},{"$f":"(U199/Instructions!$C$33)*100","v":{"$error":"#VALUE!"}},"----","E","E","E","E","E","E","E","E","E","E","--",null,null,null,null,null,{"$f":"Table_2[[#This Row],[Column51]]&Table_2[[#This Row],[Column52]]&AW201","v":""}]
[199,null,null,null,null,null,null,null,null,null,null,null,null,null,null,null,null,null,null,null,"--",0,null,null,{"$f":"(K200/Instructions!$C$23)*100","v":0},{"$f":"(L200/Instructions!$C$24)*100","v":0},{"$f":"(M200/Instructions!$C$25)*100","v":0},{"$f":"(N200/Instructions!$C$26)*100","v":0},{"$f":"(O200/Instructions!$C$27)*100","v":0},{"$f":"(P200/Instructions!$C$28)*100","v":0},{"$f":"(Q200/Instructions!$C$29)*100","v":0},{"$f":"(R200/Instructions!$C$30)*100","v":0},{"$f":"(S200/Instructions!$C$31)*100","v":0},{"$f":"(T200/Instructions!$C$30)*100","v":0},{"$f":"(U200/Instructions!$C$33)*100","v":{"$error":"#VALUE!"}},"----","E","E","E","E","E","E","E","E","E","E","--",null,null,null,null,null,{"$f":"Table_2[[#This Row],[Column51]]&Table_2[[#This Row],[Column52]]&AW202","v":""}]
[200,null,null,null,null,null,null,null,null,null,null,null,null,null,null,null,null,null,null,null,"--",0,null,null,{"$f":"(K201/Instructions!$C$23)*100","v":0},{"$f":"(L201/Instructions!$C$24)*100","v":0},{"$f":"(M201/Instructions!$C$25)*100","v":0},{"$f":"(N201/Instructions!$C$26)*100","v":0},{"$f":"(O201/Instructions!$C$27)*100","v":0},{"$f":"(P201/Instructions!$C$28)*100","v":0},{"$f":"(Q201/Instructions!$C$29)*100","v":0},{"$f":"(R201/Instructions!$C$30)*100","v":0},{"$f":"(S201/Instructions!$C$31)*100","v":0},{"$f":"(T201/Instructions!$C$30)*100","v":0},{"$f":"(U201/Instructions!$C$33)*100","v":{"$error":"#VALUE!"}},"----","E","E","E","E","E","E","E","E","E","E","--",null,null,null,null,null,{"$f":"Table_2[[#This Row],[Column51]]&Table_2[[#This Row],[Column52]]&AW203","v":""}]
[201,null,null,null,null,null,null,null,null,null,null,null,null,null,null,null,null,null,null,null,"--",0,null,null,{"$f":"(K202/Instructions!$C$23)*100","v":0},{"$f":"(L202/Instructions!$C$24)*100","v":0},{"$f":"(M202/Instructions!$C$25)*100","v":0},{"$f":"(N202/Instructions!$C$26)*100","v":0},{"$f":"(O202/Instructions!$C$27)*100","v":0},{"$f":"(P202/Instructions!$C$28)*100","v":0},{"$f":"(Q202/Instructions!$C$29)*100","v":0},{"$f":"(R202/Instructions!$C$30)*100","v":0},{"$f":"(S202/Instructions!$C$31)*100","v":0},{"$f":"(T202/Instructions!$C$30)*100","v":0},{"$f":"(U202/Instructions!$C$33)*100","v":{"$error":"#VALUE!"}},"----","E","E","E","E","E","E","E","E","E","E","--",null,null,null,null,null,{"$f":"Table_2[[#This Row],[Column51]]&Table_2[[#This Row],[Column52]]&AW204","v":""}]
[202,null,null,null,null,null,null,null,null,null,null,null,null,null,null,null,null,null,null,null,"--",0,null,null,{"$f":"(K203/Instructions!$C$23)*100","v":0},{"$f":"(L203/Instructions!$C$24)*100","v":0},{"$f":"(M203/Instructions!$C$25)*100","v":0},{"$f":"(N203/Instructions!$C$26)*100","v":0},{"$f":"(O203/Instructions!$C$27)*100","v":0},{"$f":"(P203/Instructions!$C$28)*100","v":0},{"$f":"(Q203/Instructions!$C$29)*100","v":0},{"$f":"(R203/Instructions!$C$30)*100","v":0},{"$f":"(S203/Instructions!$C$31)*100","v":0},{"$f":"(T203/Instructions!$C$30)*100","v":0},{"$f":"(U203/Instructions!$C$33)*100","v":{"$error":"#VALUE!"}},"----","E","E","E","E","E","E","E","E","E","E","--",null,null,null,null,null,{"$f":"Table_2[[#This Row],[Column51]]&Table_2[[#This Row],[Column52]]&AW205","v":""}]
[203,null,null,null,null,null,null,null,null,null,null,null,null,null,null,null,null,null,null,null,"--",0,null,null,{"$f":"(K204/Instructions!$C$23)*100","v":0},{"$f":"(L204/Instructions!$C$24)*100","v":0},{"$f":"(M204/Instructions!$C$25)*100","v":0},{"$f":"(N204/Instructions!$C$26)*100","v":0},{"$f":"(O204/Instructions!$C$27)*100","v":0},{"$f":"(P204/Instructions!$C$28)*100","v":0},{"$f":"(Q204/Instructions!$C$29)*100","v":0},{"$f":"(R204/Instructions!$C$30)*100","v":0},{"$f":"(S204/Instructions!$C$31)*100","v":0},{"$f":"(T204/Instructions!$C$30)*100","v":0},{"$f":"(U204/Instructions!$C$33)*100","v":{"$error":"#VALUE!"}},"----","E","E","E","E","E","E","E","E","E","E","--",null,null,null,null,null,{"$f":"Table_2[[#This Row],[Column51]]&Table_2[[#This Row],[Column52]]&AW206","v":""}]
[204,null,null,null,null,null,null,null,null,null,null,null,null,null,null,null,null,null,null,null,"--",0,null,null,{"$f":"(K205/Instructions!$C$23)*100","v":0},{"$f":"(L205/Instructions!$C$24)*100","v":0},{"$f":"(M205/Instructions!$C$25)*100","v":0},{"$f":"(N205/Instructions!$C$26)*100","v":0},{"$f":"(O205/Instructions!$C$27)*100","v":0},{"$f":"(P205/Instructions!$C$28)*100","v":0},{"$f":"(Q205/Instructions!$C$29)*100","v":0},{"$f":"(R205/Instructions!$C$30)*100","v":0},{"$f":"(S205/Instructions!$C$31)*100","v":0},{"$f":"(T205/Instructions!$C$30)*100","v":0},{"$f":"(U205/Instructions!$C$33)*100","v":{"$error":"#VALUE!"}},"----","E","E","E","E","E","E","E","E","E","E","--",null,null,null,null,null,{"$f":"Table_2[[#This Row],[Column51]]&Table_2[[#This Row],[Column52]]&AW207","v":""}]
[205,null,null,null,null,null,null,null,null,null,null,null,null,null,null,null,null,null,null,null,"--",0,null,null,{"$f":"(K206/Instructions!$C$23)*100","v":0},{"$f":"(L206/Instructions!$C$24)*100","v":0},{"$f":"(M206/Instructions!$C$25)*100","v":0},{"$f":"(N206/Instructions!$C$26)*100","v":0},{"$f":"(O206/Instructions!$C$27)*100","v":0},{"$f":"(P206/Instructions!$C$28)*100","v":0},{"$f":"(Q206/Instructions!$C$29)*100","v":0},{"$f":"(R206/Instructions!$C$30)*100","v":0},{"$f":"(S206/Instructions!$C$31)*100","v":0},{"$f":"(T206/Instructions!$C$30)*100","v":0},{"$f":"(U206/Instructions!$C$33)*100","v":{"$error":"#VALUE!"}},"----","E","E","E","E","E","E","E","E","E","E","--",null,null,null,null,null,{"$f":"Table_2[[#This Row],[Column51]]&Table_2[[#This Row],[Column52]]&AW208","v":""}]
[206,null,null,null,null,null,null,null,null,null,null,null,null,null,null,null,null,null,null,null,"--",0,null,null,{"$f":"(K207/Instructions!$C$23)*100","v":0},{"$f":"(L207/Instructions!$C$24)*100","v":0},{"$f":"(M207/Instructions!$C$25)*100","v":0},{"$f":"(N207/Instructions!$C$26)*100","v":0},{"$f":"(O207/Instructions!$C$27)*100","v":0},{"$f":"(P207/Instructions!$C$28)*100","v":0},{"$f":"(Q207/Instructions!$C$29)*100","v":0},{"$f":"(R207/Instructions!$C$30)*100","v":0},{"$f":"(S207/Instructions!$C$31)*100","v":0},{"$f":"(T207/Instructions!$C$30)*100","v":0},{"$f":"(U207/Instructions!$C$33)*100","v":{"$error":"#VALUE!"}},"----","E","E","E","E","E","E","E","E","E","E","--",null,null,null,null,null,{"$f":"Table_2[[#This Row],[Column51]]&Table_2[[#This Row],[Column52]]&AW209","v":""}]
[207,null,null,null,null,null,null,null,null,null,null,null,null,null,null,null,null,null,null,null,"--",0,null,null,{"$f":"(K208/Instructions!$C$23)*100","v":0},{"$f":"(L208/Instructions!$C$24)*100","v":0},{"$f":"(M208/Instructions!$C$25)*100","v":0},{"$f":"(N208/Instructions!$C$26)*100","v":0},{"$f":"(O208/Instructions!$C$27)*100","v":0},{"$f":"(P208/Instructions!$C$28)*100","v":0},{"$f":"(Q208/Instructions!$C$29)*100","v":0},{"$f":"(R208/Instructions!$C$30)*100","v":0},{"$f":"(S208/Instructions!$C$31)*100","v":0},{"$f":"(T208/Instructions!$C$30)*100","v":0},{"$f":"(U208/Instructions!$C$33)*100","v":{"$error":"#VALUE!"}},"----","E","E","E","E","E","E","E","E","E","E","--",null,null,null,null,null,{"$f":"Table_2[[#This Row],[Column51]]&Table_2[[#This Row],[Column52]]&AW210","v":""}]
[208,null,null,null,null,null,null,null,null,null,null,null,null,null,null,null,null,null,null,null,"--",0,null,null,{"$f":"(K209/Instructions!$C$23)*100","v":0},{"$f":"(L209/Instructions!$C$24)*100","v":0},{"$f":"(M209/Instructions!$C$25)*100","v":0},{"$f":"(N209/Instructions!$C$26)*100","v":0},{"$f":"(O209/Instructions!$C$27)*100","v":0},{"$f":"(P209/Instructions!$C$28)*100","v":0},{"$f":"(Q209/Instructions!$C$29)*100","v":0},{"$f":"(R209/Instructions!$C$30)*100","v":0},{"$f":"(S209/Instructions!$C$31)*100","v":0},{"$f":"(T209/Instructions!$C$30)*100","v":0},{"$f":"(U209/Instructions!$C$33)*100","v":{"$error":"#VALUE!"}},"----","E","E","E","E","E","E","E","E","E","E","--",null,null,null,null,null,{"$f":"Table_2[[#This Row],[Column51]]&Table_2[[#This Row],[Column52]]&AW211","v":""}]
[209,null,null,null,null,null,null,null,null,null,null,null,null,null,null,null,null,null,null,null,"--",0,null,null,{"$f":"(K210/Instructions!$C$23)*100","v":0},{"$f":"(L210/Instructions!$C$24)*100","v":0},{"$f":"(M210/Instructions!$C$25)*100","v":0},{"$f":"(N210/Instructions!$C$26)*100","v":0},{"$f":"(O210/Instructions!$C$27)*100","v":0},{"$f":"(P210/Instructions!$C$28)*100","v":0},{"$f":"(Q210/Instructions!$C$29)*100","v":0},{"$f":"(R210/Instructions!$C$30)*100","v":0},{"$f":"(S210/Instructions!$C$31)*100","v":0},{"$f":"(T210/Instructions!$C$30)*100","v":0},{"$f":"(U210/Instructions!$C$33)*100","v":{"$error":"#VALUE!"}},"----","E","E","E","E","E","E","E","E","E","E","--",null,null,null,null,null,{"$f":"Table_2[[#This Row],[Column51]]&Table_2[[#This Row],[Column52]]&AW212","v":""}]
[210,null,null,null,null,null,null,null,null,null,null,null,null,null,null,null,null,null,null,null,"--",0,null,null,{"$f":"(K211/Instructions!$C$23)*100","v":0},{"$f":"(L211/Instructions!$C$24)*100","v":0},{"$f":"(M211/Instructions!$C$25)*100","v":0},{"$f":"(N211/Instructions!$C$26)*100","v":0},{"$f":"(O211/Instructions!$C$27)*100","v":0},{"$f":"(P211/Instructions!$C$28)*100","v":0},{"$f":"(Q211/Instructions!$C$29)*100","v":0},{"$f":"(R211/Instructions!$C$30)*100","v":0},{"$f":"(S211/Instructions!$C$31)*100","v":0},{"$f":"(T211/Instructions!$C$30)*100","v":0},{"$f":"(U211/Instructions!$C$33)*100","v":{"$error":"#VALUE!"}},"----","E","E","E","E","E","E","E","E","E","E","--",null,null,null,null,null,{"$f":"Table_2[[#This Row],[Column51]]&Table_2[[#This Row],[Column52]]&AW213","v":""}]
[211,null,null,null,null,null,null,null,null,null,null,null,null,null,null,null,null,null,null,null,"--",0,null,null,{"$f":"(K212/Instructions!$C$23)*100","v":0},{"$f":"(L212/Instructions!$C$24)*100","v":0},{"$f":"(M212/Instructions!$C$25)*100","v":0},{"$f":"(N212/Instructions!$C$26)*100","v":0},{"$f":"(O212/Instructions!$C$27)*100","v":0},{"$f":"(P212/Instructions!$C$28)*100","v":0},{"$f":"(Q212/Instructions!$C$29)*100","v":0},{"$f":"(R212/Instructions!$C$30)*100","v":0},{"$f":"(S212/Instructions!$C$31)*100","v":0},{"$f":"(T212/Instructions!$C$30)*100","v":0},{"$f":"(U212/Instructions!$C$33)*100","v":{"$error":"#VALUE!"}},"----","E","E","E","E","E","E","E","E","E","E","--",null,null,null,null,null,{"$f":"Table_2[[#This Row],[Column51]]&Table_2[[#This Row],[Column52]]&AW214","v":""}]
[212,null,null,null,null,null,null,null,null,null,null,null,null,null,null,null,null,null,null,null,"--",0,null,null,{"$f":"(K213/Instructions!$C$23)*100","v":0},{"$f":"(L213/Instructions!$C$24)*100","v":0},{"$f":"(M213/Instructions!$C$25)*100","v":0},{"$f":"(N213/Instructions!$C$26)*100","v":0},{"$f":"(O213/Instructions!$C$27)*100","v":0},{"$f":"(P213/Instructions!$C$28)*100","v":0},{"$f":"(Q213/Instructions!$C$29)*100","v":0},{"$f":"(R213/Instructions!$C$30)*100","v":0},{"$f":"(S213/Instructions!$C$31)*100","v":0},{"$f":"(T213/Instructions!$C$30)*100","v":0},{"$f":"(U213/Instructions!$C$33)*100","v":{"$error":"#VALUE!"}},"----","E","E","E","E","E","E","E","E","E","E","--",null,null,null,null,null,{"$f":"Table_2[[#This Row],[Column51]]&Table_2[[#This Row],[Column52]]&AW215","v":""}]
[213,null,null,null,null,null,null,null,null,null,null,null,null,null,null,null,null,null,null,null,"--",0,null,null,{"$f":"(K214/Instructions!$C$23)*100","v":0},{"$f":"(L214/Instructions!$C$24)*100","v":0},{"$f":"(M214/Instructions!$C$25)*100","v":0},{"$f":"(N214/Instructions!$C$26)*100","v":0},{"$f":"(O214/Instructions!$C$27)*100","v":0},{"$f":"(P214/Instructions!$C$28)*100","v":0},{"$f":"(Q214/Instructions!$C$29)*100","v":0},{"$f":"(R214/Instructions!$C$30)*100","v":0},{"$f":"(S214/Instructions!$C$31)*100","v":0},{"$f":"(T214/Instructions!$C$30)*100","v":0},{"$f":"(U214/Instructions!$C$33)*100","v":{"$error":"#VALUE!"}},"----","E","E","E","E","E","E","E","E","E","E","--",null,null,null,null,null,{"$f":"Table_2[[#This Row],[Column51]]&Table_2[[#This Row],[Column52]]&AW216","v":""}]
[214,null,null,null,null,null,null,null,null,null,null,null,null,null,null,null,null,null,null,null,"--",0,null,null,{"$f":"(K215/Instructions!$C$23)*100","v":0},{"$f":"(L215/Instructions!$C$24)*100","v":0},{"$f":"(M215/Instructions!$C$25)*100","v":0},{"$f":"(N215/Instructions!$C$26)*100","v":0},{"$f":"(O215/Instructions!$C$27)*100","v":0},{"$f":"(P215/Instructions!$C$28)*100","v":0},{"$f":"(Q215/Instructions!$C$29)*100","v":0},{"$f":"(R215/Instructions!$C$30)*100","v":0},{"$f":"(S215/Instructions!$C$31)*100","v":0},{"$f":"(T215/Instructions!$C$30)*100","v":0},{"$f":"(U215/Instructions!$C$33)*100","v":{"$error":"#VALUE!"}},"----","E","E","E","E","E","E","E","E","E","E","--",null,null,null,null,null,{"$f":"Table_2[[#This Row],[Column51]]&Table_2[[#This Row],[Column52]]&AW217","v":""}]
[215,null,null,null,null,null,null,null,null,null,null,null,null,null,null,null,null,null,null,null,"--",0,null,null,{"$f":"(K216/Instructions!$C$23)*100","v":0},{"$f":"(L216/Instructions!$C$24)*100","v":0},{"$f":"(M216/Instructions!$C$25)*100","v":0},{"$f":"(N216/Instructions!$C$26)*100","v":0},{"$f":"(O216/Instructions!$C$27)*100","v":0},{"$f":"(P216/Instructions!$C$28)*100","v":0},{"$f":"(Q216/Instructions!$C$29)*100","v":0},{"$f":"(R216/Instructions!$C$30)*100","v":0},{"$f":"(S216/Instructions!$C$31)*100","v":0},{"$f":"(T216/Instructions!$C$30)*100","v":0},{"$f":"(U216/Instructions!$C$33)*100","v":{"$error":"#VALUE!"}},"----","E","E","E","E","E","E","E","E","E","E","--",null,null,null,null,null,{"$f":"Table_2[[#This Row],[Column51]]&Table_2[[#This Row],[Column52]]&AW218","v":""}]
[216,null,null,null,null,null,null,null,null,null,null,null,null,null,null,null,null,null,null,null,"--",0,null,null,{"$f":"(K217/Instructions!$C$23)*100","v":0},{"$f":"(L217/Instructions!$C$24)*100","v":0},{"$f":"(M217/Instructions!$C$25)*100","v":0},{"$f":"(N217/Instructions!$C$26)*100","v":0},{"$f":"(O217/Instructions!$C$27)*100","v":0},{"$f":"(P217/Instructions!$C$28)*100","v":0},{"$f":"(Q217/Instructions!$C$29)*100","v":0},{"$f":"(R217/Instructions!$C$30)*100","v":0},{"$f":"(S217/Instructions!$C$31)*100","v":0},{"$f":"(T217/Instructions!$C$30)*100","v":0},{"$f":"(U217/Instructions!$C$33)*100","v":{"$error":"#VALUE!"}},"----","E","E","E","E","E","E","E","E","E","E","--",null,null,null,null,null,{"$f":"Table_2[[#This Row],[Column51]]&Table_2[[#This Row],[Column52]]&AW219","v":""}]
[217,null,null,null,null,null,null,null,null,null,null,null,null,null,null,null,null,null,null,null,"--",0,null,null,{"$f":"(K218/Instructions!$C$23)*100","v":0},{"$f":"(L218/Instructions!$C$24)*100","v":0},{"$f":"(M218/Instructions!$C$25)*100","v":0},{"$f":"(N218/Instructions!$C$26)*100","v":0},{"$f":"(O218/Instructions!$C$27)*100","v":0},{"$f":"(P218/Instructions!$C$28)*100","v":0},{"$f":"(Q218/Instructions!$C$29)*100","v":0},{"$f":"(R218/Instructions!$C$30)*100","v":0},{"$f":"(S218/Instructions!$C$31)*100","v":0},{"$f":"(T218/Instructions!$C$30)*100","v":0},{"$f":"(U218/Instructions!$C$33)*100","v":{"$error":"#VALUE!"}},"----","E","E","E","E","E","E","E","E","E","E","--",null,null,null,null,null,{"$f":"Table_2[[#This Row],[Column51]]&Table_2[[#This Row],[Column52]]&AW220","v":""}]
[218,null,null,null,null,null,null,null,null,null,null,null,null,null,null,null,null,null,null,null,"--",0,null,null,{"$f":"(K219/Instructions!$C$23)*100","v":0},{"$f":"(L219/Instructions!$C$24)*100","v":0},{"$f":"(M219/Instructions!$C$25)*100","v":0},{"$f":"(N219/Instructions!$C$26)*100","v":0},{"$f":"(O219/Instructions!$C$27)*100","v":0},{"$f":"(P219/Instructions!$C$28)*100","v":0},{"$f":"(Q219/Instructions!$C$29)*100","v":0},{"$f":"(R219/Instructions!$C$30)*100","v":0},{"$f":"(S219/Instructions!$C$31)*100","v":0},{"$f":"(T219/Instructions!$C$30)*100","v":0},{"$f":"(U219/Instructions!$C$33)*100","v":{"$error":"#VALUE!"}},"----","E","E","E","E","E","E","E","E","E","E","--",null,null,null,null,null,{"$f":"Table_2[[#This Row],[Column51]]&Table_2[[#This Row],[Column52]]&AW221","v":""}]
[219,null,null,null,null,null,null,null,null,null,null,null,null,null,null,null,null,null,null,null,"--",0,null,null,{"$f":"(K220/Instructions!$C$23)*100","v":0},{"$f":"(L220/Instructions!$C$24)*100","v":0},{"$f":"(M220/Instructions!$C$25)*100","v":0},{"$f":"(N220/Instructions!$C$26)*100","v":0},{"$f":"(O220/Instructions!$C$27)*100","v":0},{"$f":"(P220/Instructions!$C$28)*100","v":0},{"$f":"(Q220/Instructions!$C$29)*100","v":0},{"$f":"(R220/Instructions!$C$30)*100","v":0},{"$f":"(S220/Instructions!$C$31)*100","v":0},{"$f":"(T220/Instructions!$C$30)*100","v":0},{"$f":"(U220/Instructions!$C$33)*100","v":{"$error":"#VALUE!"}},"----","E","E","E","E","E","E","E","E","E","E","--",null,null,null,null,null,{"$f":"Table_2[[#This Row],[Column51]]&Table_2[[#This Row],[Column52]]&AW222","v":""}]
[220,null,null,null,null,null,null,null,null,null,null,null,null,null,null,null,null,null,null,null,"--",0,null,null,{"$f":"(K221/Instructions!$C$23)*100","v":0},{"$f":"(L221/Instructions!$C$24)*100","v":0},{"$f":"(M221/Instructions!$C$25)*100","v":0},{"$f":"(N221/Instructions!$C$26)*100","v":0},{"$f":"(O221/Instructions!$C$27)*100","v":0},{"$f":"(P221/Instructions!$C$28)*100","v":0},{"$f":"(Q221/Instructions!$C$29)*100","v":0},{"$f":"(R221/Instructions!$C$30)*100","v":0},{"$f":"(S221/Instructions!$C$31)*100","v":0},{"$f":"(T221/Instructions!$C$30)*100","v":0},{"$f":"(U221/Instructions!$C$33)*100","v":{"$error":"#VALUE!"}},"----","E","E","E","E","E","E","E","E","E","E","--",null,null,null,null,null,{"$f":"Table_2[[#This Row],[Column51]]&Table_2[[#This Row],[Column52]]&AW223","v":""}]
[221,null,null,null,null,null,null,null,null,null,null,null,null,null,null,null,null,null,null,null,"--",0,null,null,{"$f":"(K222/Instructions!$C$23)*100","v":0},{"$f":"(L222/Instructions!$C$24)*100","v":0},{"$f":"(M222/Instructions!$C$25)*100","v":0},{"$f":"(N222/Instructions!$C$26)*100","v":0},{"$f":"(O222/Instructions!$C$27)*100","v":0},{"$f":"(P222/Instructions!$C$28)*100","v":0},{"$f":"(Q222/Instructions!$C$29)*100","v":0},{"$f":"(R222/Instructions!$C$30)*100","v":0},{"$f":"(S222/Instructions!$C$31)*100","v":0},{"$f":"(T222/Instructions!$C$30)*100","v":0},{"$f":"(U222/Instructions!$C$33)*100","v":{"$error":"#VALUE!"}},"----","E","E","E","E","E","E","E","E","E","E","--",null,null,null,null,null,{"$f":"Table_2[[#This Row],[Column51]]&Table_2[[#This Row],[Column52]]&AW224","v":""}]
[222,null,null,null,null,null,null,null,null,null,null,null,null,null,null,null,null,null,null,null,"--",0,null,null,{"$f":"(K223/Instructions!$C$23)*100","v":0},{"$f":"(L223/Instructions!$C$24)*100","v":0},{"$f":"(M223/Instructions!$C$25)*100","v":0},{"$f":"(N223/Instructions!$C$26)*100","v":0},{"$f":"(O223/Instructions!$C$27)*100","v":0},{"$f":"(P223/Instructions!$C$28)*100","v":0},{"$f":"(Q223/Instructions!$C$29)*100","v":0},{"$f":"(R223/Instructions!$C$30)*100","v":0},{"$f":"(S223/Instructions!$C$31)*100","v":0},{"$f":"(T223/Instructions!$C$30)*100","v":0},{"$f":"(U223/Instructions!$C$33)*100","v":{"$error":"#VALUE!"}},"----","E","E","E","E","E","E","E","E","E","E","--",null,null,null,null,null,{"$f":"Table_2[[#This Row],[Column51]]&Table_2[[#This Row],[Column52]]&AW225","v":""}]
[223,null,null,null,null,null,null,null,null,null,null,null,null,null,null,null,null,null,null,null,"--",0,null,null,{"$f":"(K224/Instructions!$C$23)*100","v":0},{"$f":"(L224/Instructions!$C$24)*100","v":0},{"$f":"(M224/Instructions!$C$25)*100","v":0},{"$f":"(N224/Instructions!$C$26)*100","v":0},{"$f":"(O224/Instructions!$C$27)*100","v":0},{"$f":"(P224/Instructions!$C$28)*100","v":0},{"$f":"(Q224/Instructions!$C$29)*100","v":0},{"$f":"(R224/Instructions!$C$30)*100","v":0},{"$f":"(S224/Instructions!$C$31)*100","v":0},{"$f":"(T224/Instructions!$C$30)*100","v":0},{"$f":"(U224/Instructions!$C$33)*100","v":{"$error":"#VALUE!"}},"----","E","E","E","E","E","E","E","E","E","E","--",null,null,null,null,null,{"$f":"Table_2[[#This Row],[Column51]]&Table_2[[#This Row],[Column52]]&AW226","v":""}]
[224,null,null,null,null,null,null,null,null,null,null,null,null,null,null,null,null,null,null,null,"--",0,null,null,{"$f":"(K225/Instructions!$C$23)*100","v":0},{"$f":"(L225/Instructions!$C$24)*100","v":0},{"$f":"(M225/Instructions!$C$25)*100","v":0},{"$f":"(N225/Instructions!$C$26)*100","v":0},{"$f":"(O225/Instructions!$C$27)*100","v":0},{"$f":"(P225/Instructions!$C$28)*100","v":0},{"$f":"(Q225/Instructions!$C$29)*100","v":0},{"$f":"(R225/Instructions!$C$30)*100","v":0},{"$f":"(S225/Instructions!$C$31)*100","v":0},{"$f":"(T225/Instructions!$C$30)*100","v":0},{"$f":"(U225/Instructions!$C$33)*100","v":{"$error":"#VALUE!"}},"----","E","E","E","E","E","E","E","E","E","E","--",null,null,null,null,null,{"$f":"Table_2[[#This Row],[Column51]]&Table_2[[#This Row],[Column52]]&AW227","v":""}]
[225,null,null,null,null,null,null,null,null,null,null,null,null,null,null,null,null,null,null,null,"--",0,null,null,{"$f":"(K226/Instructions!$C$23)*100","v":0},{"$f":"(L226/Instructions!$C$24)*100","v":0},{"$f":"(M226/Instructions!$C$25)*100","v":0},{"$f":"(N226/Instructions!$C$26)*100","v":0},{"$f":"(O226/Instructions!$C$27)*100","v":0},{"$f":"(P226/Instructions!$C$28)*100","v":0},{"$f":"(Q226/Instructions!$C$29)*100","v":0},{"$f":"(R226/Instructions!$C$30)*100","v":0},{"$f":"(S226/Instructions!$C$31)*100","v":0},{"$f":"(T226/Instructions!$C$30)*100","v":0},{"$f":"(U226/Instructions!$C$33)*100","v":{"$error":"#VALUE!"}},"----","E","E","E","E","E","E","E","E","E","E","--",null,null,null,null,null,{"$f":"Table_2[[#This Row],[Column51]]&Table_2[[#This Row],[Column52]]&AW228","v":""}]
[226,null,null,null,null,null,null,null,null,null,null,null,null,null,null,null,null,null,null,null,"--",0,null,null,{"$f":"(K227/Instructions!$C$23)*100","v":0},{"$f":"(L227/Instructions!$C$24)*100","v":0},{"$f":"(M227/Instructions!$C$25)*100","v":0},{"$f":"(N227/Instructions!$C$26)*100","v":0},{"$f":"(O227/Instructions!$C$27)*100","v":0},{"$f":"(P227/Instructions!$C$28)*100","v":0},{"$f":"(Q227/Instructions!$C$29)*100","v":0},{"$f":"(R227/Instructions!$C$30)*100","v":0},{"$f":"(S227/Instructions!$C$31)*100","v":0},{"$f":"(T227/Instructions!$C$30)*100","v":0},{"$f":"(U227/Instructions!$C$33)*100","v":{"$error":"#VALUE!"}},"----","E","E","E","E","E","E","E","E","E","E","--",null,null,null,null,null,{"$f":"Table_2[[#This Row],[Column51]]&Table_2[[#This Row],[Column52]]&AW229","v":""}]
[227,null,null,null,null,null,null,null,null,null,null,null,null,null,null,null,null,null,null,null,"--",0,null,null,{"$f":"(K228/Instructions!$C$23)*100","v":0},{"$f":"(L228/Instructions!$C$24)*100","v":0},{"$f":"(M228/Instructions!$C$25)*100","v":0},{"$f":"(N228/Instructions!$C$26)*100","v":0},{"$f":"(O228/Instructions!$C$27)*100","v":0},{"$f":"(P228/Instructions!$C$28)*100","v":0},{"$f":"(Q228/Instructions!$C$29)*100","v":0},{"$f":"(R228/Instructions!$C$30)*100","v":0},{"$f":"(S228/Instructions!$C$31)*100","v":0},{"$f":"(T228/Instructions!$C$30)*100","v":0},{"$f":"(U228/Instructions!$C$33)*100","v":{"$error":"#VALUE!"}},"----","E","E","E","E","E","E","E","E","E","E","--",null,null,null,null,null,{"$f":"Table_2[[#This Row],[Column51]]&Table_2[[#This Row],[Column52]]&AW230","v":""}]
[228,null,null,null,null,null,null,null,null,null,null,null,null,null,null,null,null,null,null,null,"--",0,null,null,{"$f":"(K229/Instructions!$C$23)*100","v":0},{"$f":"(L229/Instructions!$C$24)*100","v":0},{"$f":"(M229/Instructions!$C$25)*100","v":0},{"$f":"(N229/Instructions!$C$26)*100","v":0},{"$f":"(O229/Instructions!$C$27)*100","v":0},{"$f":"(P229/Instructions!$C$28)*100","v":0},{"$f":"(Q229/Instructions!$C$29)*100","v":0},{"$f":"(R229/Instructions!$C$30)*100","v":0},{"$f":"(S229/Instructions!$C$31)*100","v":0},{"$f":"(T229/Instructions!$C$30)*100","v":0},{"$f":"(U229/Instructions!$C$33)*100","v":{"$error":"#VALUE!"}},"----","E","E","E","E","E","E","E","E","E","E","--",null,null,null,null,null,{"$f":"Table_2[[#This Row],[Column51]]&Table_2[[#This Row],[Column52]]&AW231","v":""}]
[229,null,null,null,null,null,null,null,null,null,null,null,null,null,null,null,null,null,null,null,"--",0,null,null,{"$f":"(K230/Instructions!$C$23)*100","v":0},{"$f":"(L230/Instructions!$C$24)*100","v":0},{"$f":"(M230/Instructions!$C$25)*100","v":0},{"$f":"(N230/Instructions!$C$26)*100","v":0},{"$f":"(O230/Instructions!$C$27)*100","v":0},{"$f":"(P230/Instructions!$C$28)*100","v":0},{"$f":"(Q230/Instructions!$C$29)*100","v":0},{"$f":"(R230/Instructions!$C$30)*100","v":0},{"$f":"(S230/Instructions!$C$31)*100","v":0},{"$f":"(T230/Instructions!$C$30)*100","v":0},{"$f":"(U230/Instructions!$C$33)*100","v":{"$error":"#VALUE!"}},"----","E","E","E","E","E","E","E","E","E","E","--",null,null,null,null,null,{"$f":"Table_2[[#This Row],[Column51]]&Table_2[[#This Row],[Column52]]&AW232","v":""}]
[230,null,null,null,null,null,null,null,null,null,null,null,null,null,null,null,null,null,null,null,"--",0,null,null,{"$f":"(K231/Instructions!$C$23)*100","v":0},{"$f":"(L231/Instructions!$C$24)*100","v":0},{"$f":"(M231/Instructions!$C$25)*100","v":0},{"$f":"(N231/Instructions!$C$26)*100","v":0},{"$f":"(O231/Instructions!$C$27)*100","v":0},{"$f":"(P231/Instructions!$C$28)*100","v":0},{"$f":"(Q231/Instructions!$C$29)*100","v":0},{"$f":"(R231/Instructions!$C$30)*100","v":0},{"$f":"(S231/Instructions!$C$31)*100","v":0},{"$f":"(T231/Instructions!$C$30)*100","v":0},{"$f":"(U231/Instructions!$C$33)*100","v":{"$error":"#VALUE!"}},"----","E","E","E","E","E","E","E","E","E","E","--",null,null,null,null,null,{"$f":"Table_2[[#This Row],[Column51]]&Table_2[[#This Row],[Column52]]&AW233","v":""}]
[231,null,null,null,null,null,null,null,null,null,null,null,null,null,null,null,null,null,null,null,"--",0,null,null,{"$f":"(K232/Instructions!$C$23)*100","v":0},{"$f":"(L232/Instructions!$C$24)*100","v":0},{"$f":"(M232/Instructions!$C$25)*100","v":0},{"$f":"(N232/Instructions!$C$26)*100","v":0},{"$f":"(O232/Instructions!$C$27)*100","v":0},{"$f":"(P232/Instructions!$C$28)*100","v":0},{"$f":"(Q232/Instructions!$C$29)*100","v":0},{"$f":"(R232/Instructions!$C$30)*100","v":0},{"$f":"(S232/Instructions!$C$31)*100","v":0},{"$f":"(T232/Instructions!$C$30)*100","v":0},{"$f":"(U232/Instructions!$C$33)*100","v":{"$error":"#VALUE!"}},"----","E","E","E","E","E","E","E","E","E","E","--",null,null,null,null,null,{"$f":"Table_2[[#This Row],[Column51]]&Table_2[[#This Row],[Column52]]&AW234","v":""}]
[232,null,null,null,null,null,null,null,null,null,null,null,null,null,null,null,null,null,null,null,"--",0,null,null,{"$f":"(K233/Instructions!$C$23)*100","v":0},{"$f":"(L233/Instructions!$C$24)*100","v":0},{"$f":"(M233/Instructions!$C$25)*100","v":0},{"$f":"(N233/Instructions!$C$26)*100","v":0},{"$f":"(O233/Instructions!$C$27)*100","v":0},{"$f":"(P233/Instructions!$C$28)*100","v":0},{"$f":"(Q233/Instructions!$C$29)*100","v":0},{"$f":"(R233/Instructions!$C$30)*100","v":0},{"$f":"(S233/Instructions!$C$31)*100","v":0},{"$f":"(T233/Instructions!$C$30)*100","v":0},{"$f":"(U233/Instructions!$C$33)*100","v":{"$error":"#VALUE!"}},"----","E","E","E","E","E","E","E","E","E","E","--",null,null,null,null,null,{"$f":"Table_2[[#This Row],[Column51]]&Table_2[[#This Row],[Column52]]&AW235","v":""}]
[233,null,null,null,null,null,null,null,null,null,null,null,null,null,null,null,null,null,null,null,"--",0,null,null,{"$f":"(K234/Instructions!$C$23)*100","v":0},{"$f":"(L234/Instructions!$C$24)*100","v":0},{"$f":"(M234/Instructions!$C$25)*100","v":0},{"$f":"(N234/Instructions!$C$26)*100","v":0},{"$f":"(O234/Instructions!$C$27)*100","v":0},{"$f":"(P234/Instructions!$C$28)*100","v":0},{"$f":"(Q234/Instructions!$C$29)*100","v":0},{"$f":"(R234/Instructions!$C$30)*100","v":0},{"$f":"(S234/Instructions!$C$31)*100","v":0},{"$f":"(T234/Instructions!$C$30)*100","v":0},{"$f":"(U234/Instructions!$C$33)*100","v":{"$error":"#VALUE!"}},"----","E","E","E","E","E","E","E","E","E","E","--",null,null,null,null,null,{"$f":"Table_2[[#This Row],[Column51]]&Table_2[[#This Row],[Column52]]&AW236","v":""}]
[234,null,null,null,null,null,null,null,null,null,null,null,null,null,null,null,null,null,null,null,"--",0,null,null,{"$f":"(K235/Instructions!$C$23)*100","v":0},{"$f":"(L235/Instructions!$C$24)*100","v":0},{"$f":"(M235/Instructions!$C$25)*100","v":0},{"$f":"(N235/Instructions!$C$26)*100","v":0},{"$f":"(O235/Instructions!$C$27)*100","v":0},{"$f":"(P235/Instructions!$C$28)*100","v":0},{"$f":"(Q235/Instructions!$C$29)*100","v":0},{"$f":"(R235/Instructions!$C$30)*100","v":0},{"$f":"(S235/Instructions!$C$31)*100","v":0},{"$f":"(T235/Instructions!$C$30)*100","v":0},{"$f":"(U235/Instructions!$C$33)*100","v":{"$error":"#VALUE!"}},"----","E","E","E","E","E","E","E","E","E","E","--",null,null,null,null,null,{"$f":"Table_2[[#This Row],[Column51]]&Table_2[[#This Row],[Column52]]&AW237","v":""}]
[235,null,null,null,null,null,null,null,null,null,null,null,null,null,null,null,null,null,null,null,"--",0,null,null,{"$f":"(K236/Instructions!$C$23)*100","v":0},{"$f":"(L236/Instructions!$C$24)*100","v":0},{"$f":"(M236/Instructions!$C$25)*100","v":0},{"$f":"(N236/Instructions!$C$26)*100","v":0},{"$f":"(O236/Instructions!$C$27)*100","v":0},{"$f":"(P236/Instructions!$C$28)*100","v":0},{"$f":"(Q236/Instructions!$C$29)*100","v":0},{"$f":"(R236/Instructions!$C$30)*100","v":0},{"$f":"(S236/Instructions!$C$31)*100","v":0},{"$f":"(T236/Instructions!$C$30)*100","v":0},{"$f":"(U236/Instructions!$C$33)*100","v":{"$error":"#VALUE!"}},"----","E","E","E","E","E","E","E","E","E","E","--",null,null,null,null,null,{"$f":"Table_2[[#This Row],[Column51]]&Table_2[[#This Row],[Column52]]&AW238","v":""}]
[236,null,null,null,null,null,null,null,null,null,null,null,null,null,null,null,null,null,null,null,"--",0,null,null,{"$f":"(K237/Instructions!$C$23)*100","v":0},{"$f":"(L237/Instructions!$C$24)*100","v":0},{"$f":"(M237/Instructions!$C$25)*100","v":0},{"$f":"(N237/Instructions!$C$26)*100","v":0},{"$f":"(O237/Instructions!$C$27)*100","v":0},{"$f":"(P237/Instructions!$C$28)*100","v":0},{"$f":"(Q237/Instructions!$C$29)*100","v":0},{"$f":"(R237/Instructions!$C$30)*100","v":0},{"$f":"(S237/Instructions!$C$31)*100","v":0},{"$f":"(T237/Instructions!$C$30)*100","v":0},{"$f":"(U237/Instructions!$C$33)*100","v":{"$error":"#VALUE!"}},"----","E","E","E","E","E","E","E","E","E","E","--",null,null,null,null,null,{"$f":"Table_2[[#This Row],[Column51]]&Table_2[[#This Row],[Column52]]&AW239","v":""}]
[237,null,null,null,null,null,null,null,null,null,null,null,null,null,null,null,null,null,null,null,"--",0,null,null,{"$f":"(K238/Instructions!$C$23)*100","v":0},{"$f":"(L238/Instructions!$C$24)*100","v":0},{"$f":"(M238/Instructions!$C$25)*100","v":0},{"$f":"(N238/Instructions!$C$26)*100","v":0},{"$f":"(O238/Instructions!$C$27)*100","v":0},{"$f":"(P238/Instructions!$C$28)*100","v":0},{"$f":"(Q238/Instructions!$C$29)*100","v":0},{"$f":"(R238/Instructions!$C$30)*100","v":0},{"$f":"(S238/Instructions!$C$31)*100","v":0},{"$f":"(T238/Instructions!$C$30)*100","v":0},{"$f":"(U238/Instructions!$C$33)*100","v":{"$error":"#VALUE!"}},"----","E","E","E","E","E","E","E","E","E","E","--",null,null,null,null,null,{"$f":"Table_2[[#This Row],[Column51]]&Table_2[[#This Row],[Column52]]&AW240","v":""}]
[238,null,null,null,null,null,null,null,null,null,null,null,null,null,null,null,null,null,null,null,"--",0,null,null,{"$f":"(K239/Instructions!$C$23)*100","v":0},{"$f":"(L239/Instructions!$C$24)*100","v":0},{"$f":"(M239/Instructions!$C$25)*100","v":0},{"$f":"(N239/Instructions!$C$26)*100","v":0},{"$f":"(O239/Instructions!$C$27)*100","v":0},{"$f":"(P239/Instructions!$C$28)*100","v":0},{"$f":"(Q239/Instructions!$C$29)*100","v":0},{"$f":"(R239/Instructions!$C$30)*100","v":0},{"$f":"(S239/Instructions!$C$31)*100","v":0},{"$f":"(T239/Instructions!$C$30)*100","v":0},{"$f":"(U239/Instructions!$C$33)*100","v":{"$error":"#VALUE!"}},"----","E","E","E","E","E","E","E","E","E","E","--",null,null,null,null,null,{"$f":"Table_2[[#This Row],[Column51]]&Table_2[[#This Row],[Column52]]&AW241","v":""}]
[239,null,null,null,null,null,null,null,null,null,null,null,null,null,null,null,null,null,null,null,"--",0,null,null,{"$f":"(K240/Instructions!$C$23)*100","v":0},{"$f":"(L240/Instructions!$C$24)*100","v":0},{"$f":"(M240/Instructions!$C$25)*100","v":0},{"$f":"(N240/Instructions!$C$26)*100","v":0},{"$f":"(O240/Instructions!$C$27)*100","v":0},{"$f":"(P240/Instructions!$C$28)*100","v":0},{"$f":"(Q240/Instructions!$C$29)*100","v":0},{"$f":"(R240/Instructions!$C$30)*100","v":0},{"$f":"(S240/Instructions!$C$31)*100","v":0},{"$f":"(T240/Instructions!$C$30)*100","v":0},{"$f":"(U240/Instructions!$C$33)*100","v":{"$error":"#VALUE!"}},"----","E","E","E","E","E","E","E","E","E","E","--",null,null,null,null,null,{"$f":"Table_2[[#This Row],[Column51]]&Table_2[[#This Row],[Column52]]&AW242","v":""}]
[240,null,null,null,null,null,null,null,null,null,null,null,null,null,null,null,null,null,null,null,"--",0,null,null,{"$f":"(K241/Instructions!$C$23)*100","v":0},{"$f":"(L241/Instructions!$C$24)*100","v":0},{"$f":"(M241/Instructions!$C$25)*100","v":0},{"$f":"(N241/Instructions!$C$26)*100","v":0},{"$f":"(O241/Instructions!$C$27)*100","v":0},{"$f":"(P241/Instructions!$C$28)*100","v":0},{"$f":"(Q241/Instructions!$C$29)*100","v":0},{"$f":"(R241/Instructions!$C$30)*100","v":0},{"$f":"(S241/Instructions!$C$31)*100","v":0},{"$f":"(T241/Instructions!$C$30)*100","v":0},{"$f":"(U241/Instructions!$C$33)*100","v":{"$error":"#VALUE!"}},"----","E","E","E","E","E","E","E","E","E","E","--",null,null,null,null,null,{"$f":"Table_2[[#This Row],[Column51]]&Table_2[[#This Row],[Column52]]&AW243","v":""}]
[241,null,null,null,null,null,null,null,null,null,null,null,null,null,null,null,null,null,null,null,"--",0,null,null,{"$f":"(K242/Instructions!$C$23)*100","v":0},{"$f":"(L242/Instructions!$C$24)*100","v":0},{"$f":"(M242/Instructions!$C$25)*100","v":0},{"$f":"(N242/Instructions!$C$26)*100","v":0},{"$f":"(O242/Instructions!$C$27)*100","v":0},{"$f":"(P242/Instructions!$C$28)*100","v":0},{"$f":"(Q242/Instructions!$C$29)*100","v":0},{"$f":"(R242/Instructions!$C$30)*100","v":0},{"$f":"(S242/Instructions!$C$31)*100","v":0},{"$f":"(T242/Instructions!$C$30)*100","v":0},{"$f":"(U242/Instructions!$C$33)*100","v":{"$error":"#VALUE!"}},"----","E","E","E","E","E","E","E","E","E","E","--",null,null,null,null,null,{"$f":"Table_2[[#This Row],[Column51]]&Table_2[[#This Row],[Column52]]&AW244","v":""}]
[242,null,null,null,null,null,null,null,null,null,null,null,null,null,null,null,null,null,null,null,"--",0,null,null,{"$f":"(K243/Instructions!$C$23)*100","v":0},{"$f":"(L243/Instructions!$C$24)*100","v":0},{"$f":"(M243/Instructions!$C$25)*100","v":0},{"$f":"(N243/Instructions!$C$26)*100","v":0},{"$f":"(O243/Instructions!$C$27)*100","v":0},{"$f":"(P243/Instructions!$C$28)*100","v":0},{"$f":"(Q243/Instructions!$C$29)*100","v":0},{"$f":"(R243/Instructions!$C$30)*100","v":0},{"$f":"(S243/Instructions!$C$31)*100","v":0},{"$f":"(T243/Instructions!$C$30)*100","v":0},{"$f":"(U243/Instructions!$C$33)*100","v":{"$error":"#VALUE!"}},{"$f":"IF(AND(Y243>=33,Z243>=33,AA243>=33,AB243>=33,AC243>=33,AD243>=33),\"PASS\",\"----\")","v":"----"},"E","E","E","E","E","E","E","E","E","E","--",null,null,null,null,null,{"$f":"Table_2[[#This Row],[Column51]]&Table_2[[#This Row],[Column52]]&AW245","v":""}]
[243,null,null,null,null,null,null,null,null,null,null,null,null,null,null,null,null,null,null,null,"--",0,null,null,{"$f":"(K244/Instructions!$C$23)*100","v":0},{"$f":"(L244/Instructions!$C$24)*100","v":0},{"$f":"(M244/Instructions!$C$25)*100","v":0},{"$f":"(N244/Instructions!$C$26)*100","v":0},{"$f":"(O244/Instructions!$C$27)*100","v":0},{"$f":"(P244/Instructions!$C$28)*100","v":0},{"$f":"(Q244/Instructions!$C$29)*100","v":0},{"$f":"(R244/Instructions!$C$30)*100","v":0},{"$f":"(S244/Instructions!$C$31)*100","v":0},{"$f":"(T244/Instructions!$C$30)*100","v":0},{"$f":"(U244/Instructions!$C$33)*100","v":{"$error":"#VALUE!"}},"----",{"$f":"IFERROR(IF(Y244>90,\"A+\",IF(Y244>80,\"A\",IF(Y244>70,\"B+\",IF(Y244>60,\"B\",IF(Y244>50,\"C+\",IF(Y244>40,\"C\",IF(Y244>=33,\"D\",\"E\"))))))),\"Abs\")","v":"E"},{"$f":"IFERROR(IF(Z244>90,\"A+\",IF(Z244>80,\"A\",IF(Z244>70,\"B+\",IF(Z244>60,\"B\",IF(Z244>50,\"C+\",IF(Z244>40,\"C\",IF(Z244>=33,\"D\",\"E\"))))))),\"Abs\")","v":"E"},{"$f":"IFERROR(IF(AA244>90,\"A+\",IF(AA244>80,\"A\",IF(AA244>70,\"B+\",IF(AA244>60,\"B\",IF(AA244>50,\"C+\",IF(AA244>40,\"C\",IF(AA244>=33,\"D\",\"E\"))))))),\"Abs\")","v":"E"},{"$f":"IFERROR(IF(AB244>90,\"A+\",IF(AB244>80,\"A\",IF(AB244>70,\"B+\",IF(AB244>60,\"B\",IF(AB244>50,\"C+\",IF(AB244>40,\"C\",IF(AB244>=33,\"D\",\"E\"))))))),\"Abs\")","v":"E"},{"$f":"IFERROR(IF(AC244>90,\"A+\",IF(AC244>80,\"A\",IF(AC244>70,\"B+\",IF(AC244>60,\"B\",IF(AC244>50,\"C+\",IF(AC244>40,\"C\",IF(AC244>=33,\"D\",\"E\"))))))),\"Abs\")","v":"E"},{"$f":"IFERROR(IF(AD244>90,\"A+\",IF(AD244>80,\"A\",IF(AD244>70,\"B+\",IF(AD244>60,\"B\",IF(AD244>50,\"C+\",IF(AD244>40,\"C\",IF(AD244>=33,\"D\",\"E\"))))))),\"Abs\")","v":"E"},{"$f":"IFERROR(IF(AE244>90,\"A+\",IF(AE244>80,\"A\",IF(AE244>70,\"B+\",IF(AE244>60,\"B\",IF(AE244>50,\"C+\",IF(AE244>40,\"C\",IF(AE244>=33,\"D\",\"E\"))))))),\"Abs\")","v":"E"},{"$f":"IFERROR(IF(AF244>90,\"A+\",IF(AF244>80,\"A\",IF(AF244>70,\"B+\",IF(AF244>60,\"B\",IF(AF244>50,\"C+\",IF(AF244>40,\"C\",IF(AF244>=33,\"D\",\"E\"))))))),\"Abs\")","v":"E"},{"$f":"IFERROR(IF(AG244>90,\"A+\",IF(AG244>80,\"A\",IF(AG244>70,\"B+\",IF(AG244>60,\"B\",IF(AG244>50,\"C+\",IF(AG244>40,\"C\",IF(AG244>=33,\"D\",\"E\"))))))),\"Abs\")","v":"E"},{"$f":"IFERROR(IF(AH244>90,\"A+\",IF(AH244>80,\"A\",IF(AH244>70,\"B+\",IF(AH244>60,\"B\",IF(AH244>50,\"C+\",IF(AH244>40,\"C\",IF(AH244>=33,\"D\",\"E\"))))))),\"Abs\")","v":"E"},"--",null,null,null,null,null,{"$f":"Table_2[[#This Row],[Column51]]&Table_2[[#This Row],[Column52]]&AW246","v":""}]
[244,null,null,null,null,null,null,null,null,null,null,null,null,null,null,null,null,null,null,null,"--",0,null,null,{"$f":"(K245/Instructions!$C$23)*100","v":0},{"$f":"(L245/Instructions!$C$24)*100","v":0},{"$f":"(M245/Instructions!$C$25)*100","v":0},{"$f":"(N245/Instructions!$C$26)*100","v":0},{"$f":"(O245/Instructions!$C$27)*100","v":0},{"$f":"(P245/Instructions!$C$28)*100","v":0},{"$f":"(Q245/Instructions!$C$29)*100","v":0},{"$f":"(R245/Instructions!$C$30)*100","v":0},{"$f":"(S245/Instructions!$C$31)*100","v":0},{"$f":"(T245/Instructions!$C$30)*100","v":0},{"$f":"(U245/Instructions!$C$33)*100","v":{"$error":"#VALUE!"}},"----","E","E","E","E","E","E","E","E","E","E","--",null,null,null,null,null,{"$f":"Table_2[[#This Row],[Column51]]&Table_2[[#This Row],[Column52]]&AW247","v":""}]
[245,null,null,null,null,null,null,null,null,null,null,null,null,null,null,null,null,null,null,null,"--",0,null,null,{"$f":"(K246/Instructions!$C$23)*100","v":0},{"$f":"(L246/Instructions!$C$24)*100","v":0},{"$f":"(M246/Instructions!$C$25)*100","v":0},{"$f":"(N246/Instructions!$C$26)*100","v":0},{"$f":"(O246/Instructions!$C$27)*100","v":0},{"$f":"(P246/Instructions!$C$28)*100","v":0},{"$f":"(Q246/Instructions!$C$29)*100","v":0},{"$f":"(R246/Instructions!$C$30)*100","v":0},{"$f":"(S246/Instructions!$C$31)*100","v":0},{"$f":"(T246/Instructions!$C$30)*100","v":0},{"$f":"(U246/Instructions!$C$33)*100","v":{"$error":"#VALUE!"}},"----","E","E","E","E","E","E","E","E","E","E","--",null,null,null,null,null,{"$f":"Table_2[[#This Row],[Column51]]&Table_2[[#This Row],[Column52]]&AW248","v":""}]
[246,null,null,null,null,null,null,null,null,null,null,null,null,null,null,null,null,null,null,null,"--",0,null,null,{"$f":"(K247/Instructions!$C$23)*100","v":0},{"$f":"(L247/Instructions!$C$24)*100","v":0},{"$f":"(M247/Instructions!$C$25)*100","v":0},{"$f":"(N247/Instructions!$C$26)*100","v":0},{"$f":"(O247/Instructions!$C$27)*100","v":0},{"$f":"(P247/Instructions!$C$28)*100","v":0},{"$f":"(Q247/Instructions!$C$29)*100","v":0},{"$f":"(R247/Instructions!$C$30)*100","v":0},{"$f":"(S247/Instructions!$C$31)*100","v":0},{"$f":"(T247/Instructions!$C$30)*100","v":0},{"$f":"(U247/Instructions!$C$33)*100","v":{"$error":"#VALUE!"}},"----","E","E","E","E","E","E","E","E","E","E","--",null,null,null,null,null,{"$f":"Table_2[[#This Row],[Column51]]&Table_2[[#This Row],[Column52]]&AW249","v":""}]
[247,null,null,null,null,null,null,null,null,null,null,null,null,null,null,null,null,null,null,null,"--",0,null,null,{"$f":"(K248/Instructions!$C$23)*100","v":0},{"$f":"(L248/Instructions!$C$24)*100","v":0},{"$f":"(M248/Instructions!$C$25)*100","v":0},{"$f":"(N248/Instructions!$C$26)*100","v":0},{"$f":"(O248/Instructions!$C$27)*100","v":0},{"$f":"(P248/Instructions!$C$28)*100","v":0},{"$f":"(Q248/Instructions!$C$29)*100","v":0},{"$f":"(R248/Instructions!$C$30)*100","v":0},{"$f":"(S248/Instructions!$C$31)*100","v":0},{"$f":"(T248/Instructions!$C$30)*100","v":0},{"$f":"(U248/Instructions!$C$33)*100","v":{"$error":"#VALUE!"}},"----","E","E","E","E","E","E","E","E","E","E","--",null,null,null,null,null,{"$f":"Table_2[[#This Row],[Column51]]&Table_2[[#This Row],[Column52]]&AW250","v":""}]
[248,null,null,null,null,null,null,null,null,null,null,null,null,null,null,null,null,null,null,null,"--",0,null,null,{"$f":"(K249/Instructions!$C$23)*100","v":0},{"$f":"(L249/Instructions!$C$24)*100","v":0},{"$f":"(M249/Instructions!$C$25)*100","v":0},{"$f":"(N249/Instructions!$C$26)*100","v":0},{"$f":"(O249/Instructions!$C$27)*100","v":0},{"$f":"(P249/Instructions!$C$28)*100","v":0},{"$f":"(Q249/Instructions!$C$29)*100","v":0},{"$f":"(R249/Instructions!$C$30)*100","v":0},{"$f":"(S249/Instructions!$C$31)*100","v":0},{"$f":"(T249/Instructions!$C$30)*100","v":0},{"$f":"(U249/Instructions!$C$33)*100","v":{"$error":"#VALUE!"}},"----","E","E","E","E","E","E","E","E","E","E","--",null,null,null,null,null,{"$f":"Table_2[[#This Row],[Column51]]&Table_2[[#This Row],[Column52]]&AW251","v":""}]
[249,null,null,null,null,null,null,null,null,null,null,null,null,null,null,null,null,null,null,null,"--",0,null,null,{"$f":"(K250/Instructions!$C$23)*100","v":0},{"$f":"(L250/Instructions!$C$24)*100","v":0},{"$f":"(M250/Instructions!$C$25)*100","v":0},{"$f":"(N250/Instructions!$C$26)*100","v":0},{"$f":"(O250/Instructions!$C$27)*100","v":0},{"$f":"(P250/Instructions!$C$28)*100","v":0},{"$f":"(Q250/Instructions!$C$29)*100","v":0},{"$f":"(R250/Instructions!$C$30)*100","v":0},{"$f":"(S250/Instructions!$C$31)*100","v":0},{"$f":"(T250/Instructions!$C$30)*100","v":0},{"$f":"(U250/Instructions!$C$33)*100","v":{"$error":"#VALUE!"}},"----","E","E","E","E","E","E","E","E","E","E","--",null,null,null,null,null,{"$f":"Table_2[[#This Row],[Column51]]&Table_2[[#This Row],[Column52]]&AW252","v":""}]
[250,null,null,null,null,null,null,null,null,null,null,null,null,null,null,null,null,null,null,null,"--",0,null,null,{"$f":"(K251/Instructions!$C$23)*100","v":0},{"$f":"(L251/Instructions!$C$24)*100","v":0},{"$f":"(M251/Instructions!$C$25)*100","v":0},{"$f":"(N251/Instructions!$C$26)*100","v":0},{"$f":"(O251/Instructions!$C$27)*100","v":0},{"$f":"(P251/Instructions!$C$28)*100","v":0},{"$f":"(Q251/Instructions!$C$29)*100","v":0},{"$f":"(R251/Instructions!$C$30)*100","v":0},{"$f":"(S251/Instructions!$C$31)*100","v":0},{"$f":"(T251/Instructions!$C$30)*100","v":0},{"$f":"(U251/Instructions!$C$33)*100","v":{"$error":"#VALUE!"}},"----","E","E","E","E","E","E","E","E","E","E","--",null,null,null,null,null,{"$f":"Table_2[[#This Row],[Column51]]&Table_2[[#This Row],[Column52]]&AW253","v":""}]
[251,null,null,null,null,null,null,null,null,null,null,null,null,null,null,null,null,null,null,null,"--",0,null,null,{"$f":"(K252/Instructions!$C$23)*100","v":0},{"$f":"(L252/Instructions!$C$24)*100","v":0},{"$f":"(M252/Instructions!$C$25)*100","v":0},{"$f":"(N252/Instructions!$C$26)*100","v":0},{"$f":"(O252/Instructions!$C$27)*100","v":0},{"$f":"(P252/Instructions!$C$28)*100","v":0},{"$f":"(Q252/Instructions!$C$29)*100","v":0},{"$f":"(R252/Instructions!$C$30)*100","v":0},{"$f":"(S252/Instructions!$C$31)*100","v":0},{"$f":"(T252/Instructions!$C$30)*100","v":0},{"$f":"(U252/Instructions!$C$33)*100","v":{"$error":"#VALUE!"}},"----","E","E","E","E","E","E","E","E","E","E","--",null,null,null,null,null,{"$f":"Table_2[[#This Row],[Column51]]&Table_2[[#This Row],[Column52]]&AW254","v":""}]
[252,null,null,null,null,null,null,null,null,null,null,null,null,null,null,null,null,null,null,null,"--",0,null,null,{"$f":"(K253/Instructions!$C$23)*100","v":0},{"$f":"(L253/Instructions!$C$24)*100","v":0},{"$f":"(M253/Instructions!$C$25)*100","v":0},{"$f":"(N253/Instructions!$C$26)*100","v":0},{"$f":"(O253/Instructions!$C$27)*100","v":0},{"$f":"(P253/Instructions!$C$28)*100","v":0},{"$f":"(Q253/Instructions!$C$29)*100","v":0},{"$f":"(R253/Instructions!$C$30)*100","v":0},{"$f":"(S253/Instructions!$C$31)*100","v":0},{"$f":"(T253/Instructions!$C$30)*100","v":0},{"$f":"(U253/Instructions!$C$33)*100","v":{"$error":"#VALUE!"}},"----","E","E","E","E","E","E","E","E","E","E","--",null,null,null,null,null,{"$f":"Table_2[[#This Row],[Column51]]&Table_2[[#This Row],[Column52]]&AW255","v":""}]
[253,null,null,null,null,null,null,null,null,null,null,null,null,null,null,null,null,null,null,null,"--",0,null,null,{"$f":"(K254/Instructions!$C$23)*100","v":0},{"$f":"(L254/Instructions!$C$24)*100","v":0},{"$f":"(M254/Instructions!$C$25)*100","v":0},{"$f":"(N254/Instructions!$C$26)*100","v":0},{"$f":"(O254/Instructions!$C$27)*100","v":0},{"$f":"(P254/Instructions!$C$28)*100","v":0},{"$f":"(Q254/Instructions!$C$29)*100","v":0},{"$f":"(R254/Instructions!$C$30)*100","v":0},{"$f":"(S254/Instructions!$C$31)*100","v":0},{"$f":"(T254/Instructions!$C$30)*100","v":0},{"$f":"(U254/Instructions!$C$33)*100","v":{"$error":"#VALUE!"}},"----","E","E","E","E","E","E","E","E","E","E","--",null,null,null,null,null,{"$f":"Table_2[[#This Row],[Column51]]&Table_2[[#This Row],[Column52]]&AW256","v":""}]
[254,null,null,null,null,null,null,null,null,null,null,null,null,null,null,null,null,null,null,null,"--",0,null,null,{"$f":"(K255/Instructions!$C$23)*100","v":0},{"$f":"(L255/Instructions!$C$24)*100","v":0},{"$f":"(M255/Instructions!$C$25)*100","v":0},{"$f":"(N255/Instructions!$C$26)*100","v":0},{"$f":"(O255/Instructions!$C$27)*100","v":0},{"$f":"(P255/Instructions!$C$28)*100","v":0},{"$f":"(Q255/Instructions!$C$29)*100","v":0},{"$f":"(R255/Instructions!$C$30)*100","v":0},{"$f":"(S255/Instructions!$C$31)*100","v":0},{"$f":"(T255/Instructions!$C$30)*100","v":0},{"$f":"(U255/Instructions!$C$33)*100","v":{"$error":"#VALUE!"}},"----","E","E","E","E","E","E","E","E","E","E","--",null,null,null,null,null,{"$f":"Table_2[[#This Row],[Column51]]&Table_2[[#This Row],[Column52]]&AW257","v":""}]
[255,null,null,null,null,null,null,null,null,null,null,null,null,null,null,null,null,null,null,null,"--",0,null,null,{"$f":"(K256/Instructions!$C$23)*100","v":0},{"$f":"(L256/Instructions!$C$24)*100","v":0},{"$f":"(M256/Instructions!$C$25)*100","v":0},{"$f":"(N256/Instructions!$C$26)*100","v":0},{"$f":"(O256/Instructions!$C$27)*100","v":0},{"$f":"(P256/Instructions!$C$28)*100","v":0},{"$f":"(Q256/Instructions!$C$29)*100","v":0},{"$f":"(R256/Instructions!$C$30)*100","v":0},{"$f":"(S256/Instructions!$C$31)*100","v":0},{"$f":"(T256/Instructions!$C$30)*100","v":0},{"$f":"(U256/Instructions!$C$33)*100","v":{"$error":"#VALUE!"}},"----","E","E","E","E","E","E","E","E","E","E","--",null,null,null,null,null,{"$f":"Table_2[[#This Row],[Column51]]&Table_2[[#This Row],[Column52]]&AW258","v":""}]
[256,null,null,null,null,null,null,null,null,null,null,null,null,null,null,null,null,null,null,null,"--",0,null,null,{"$f":"(K257/Instructions!$C$23)*100","v":0},{"$f":"(L257/Instructions!$C$24)*100","v":0},{"$f":"(M257/Instructions!$C$25)*100","v":0},{"$f":"(N257/Instructions!$C$26)*100","v":0},{"$f":"(O257/Instructions!$C$27)*100","v":0},{"$f":"(P257/Instructions!$C$28)*100","v":0},{"$f":"(Q257/Instructions!$C$29)*100","v":0},{"$f":"(R257/Instructions!$C$30)*100","v":0},{"$f":"(S257/Instructions!$C$31)*100","v":0},{"$f":"(T257/Instructions!$C$30)*100","v":0},{"$f":"(U257/Instructions!$C$33)*100","v":{"$error":"#VALUE!"}},"----","E","E","E","E","E","E","E","E","E","E","--",null,null,null,null,null,{"$f":"Table_2[[#This Row],[Column51]]&Table_2[[#This Row],[Column52]]&AW259","v":""}]
[257,null,null,null,null,null,null,null,null,null,null,null,null,null,null,null,null,null,null,null,"--",0,null,null,{"$f":"(K258/Instructions!$C$23)*100","v":0},{"$f":"(L258/Instructions!$C$24)*100","v":0},{"$f":"(M258/Instructions!$C$25)*100","v":0},{"$f":"(N258/Instructions!$C$26)*100","v":0},{"$f":"(O258/Instructions!$C$27)*100","v":0},{"$f":"(P258/Instructions!$C$28)*100","v":0},{"$f":"(Q258/Instructions!$C$29)*100","v":0},{"$f":"(R258/Instructions!$C$30)*100","v":0},{"$f":"(S258/Instructions!$C$31)*100","v":0},{"$f":"(T258/Instructions!$C$30)*100","v":0},{"$f":"(U258/Instructions!$C$33)*100","v":{"$error":"#VALUE!"}},"----","E","E","E","E","E","E","E","E","E","E","--",null,null,null,null,null,{"$f":"Table_2[[#This Row],[Column51]]&Table_2[[#This Row],[Column52]]&AW260","v":""}]
[258,null,null,null,null,null,null,null,null,null,null,null,null,null,null,null,null,null,null,null,{"$f":"IF(MIN(Y259:AD259)>=33,SUM(K259:P259),\"--\")","v":"--"},{"$f":"IF(U259=\"--\",0,U259)","v":0},null,null,{"$f":"(K259/Instructions!$C$23)*100","v":0},{"$f":"(L259/Instructions!$C$24)*100","v":0},{"$f":"(M259/Instructions!$C$25)*100","v":0},{"$f":"(N259/Instructions!$C$26)*100","v":0},{"$f":"(O259/Instructions!$C$27)*100","v":0},{"$f":"(P259/Instructions!$C$28)*100","v":0},{"$f":"(Q259/Instructions!$C$29)*100","v":0},{"$f":"(R259/Instructions!$C$30)*100","v":0},{"$f":"(S259/Instructions!$C$31)*100","v":0},{"$f":"(T259/Instructions!$C$30)*100","v":0},{"$f":"(U259/Instructions!$C$33)*100","v":{"$error":"#VALUE!"}},"----","E","E","E","E","E","E","E","E","E","E",{"$f":"IFERROR(IF(AI259>90,\"A+\",IF(AI259>80,\"A\",IF(AI259>70,\"B+\",IF(AI259>60,\"B\",IF(AI259>50,\"C+\",IF(AI259>40,\"C\",IF(AI259>=33,\"D\",\"E\"))))))),\"--\")","v":"--"},null,null,null,null,null,{"$f":"Table_2[[#This Row],[Column51]]&Table_2[[#This Row],[Column52]]&AW261","v":""}]
[259,null,null,null,null,null,null,null,null,null,null,null,null,null,null,null,null,null,null,null,"--",0,null,null,{"$f":"(K260/Instructions!$C$23)*100","v":0},{"$f":"(L260/Instructions!$C$24)*100","v":0},{"$f":"(M260/Instructions!$C$25)*100","v":0},{"$f":"(N260/Instructions!$C$26)*100","v":0},{"$f":"(O260/Instructions!$C$27)*100","v":0},{"$f":"(P260/Instructions!$C$28)*100","v":0},{"$f":"(Q260/Instructions!$C$29)*100","v":0},{"$f":"(R260/Instructions!$C$30)*100","v":0},{"$f":"(S260/Instructions!$C$31)*100","v":0},{"$f":"(T260/Instructions!$C$30)*100","v":0},{"$f":"(U260/Instructions!$C$33)*100","v":{"$error":"#VALUE!"}},"----","E","E","E","E","E","E","E","E","E","E","--",null,null,null,null,null,{"$f":"Table_2[[#This Row],[Column51]]&Table_2[[#This Row],[Column52]]&AW262","v":""}]
[260,null,null,null,null,null,null,null,null,null,null,null,null,null,null,null,null,null,null,null,"--",0,null,null,{"$f":"(K261/Instructions!$C$23)*100","v":0},{"$f":"(L261/Instructions!$C$24)*100","v":0},{"$f":"(M261/Instructions!$C$25)*100","v":0},{"$f":"(N261/Instructions!$C$26)*100","v":0},{"$f":"(O261/Instructions!$C$27)*100","v":0},{"$f":"(P261/Instructions!$C$28)*100","v":0},{"$f":"(Q261/Instructions!$C$29)*100","v":0},{"$f":"(R261/Instructions!$C$30)*100","v":0},{"$f":"(S261/Instructions!$C$31)*100","v":0},{"$f":"(T261/Instructions!$C$30)*100","v":0},{"$f":"(U261/Instructions!$C$33)*100","v":{"$error":"#VALUE!"}},"----","E","E","E","E","E","E","E","E","E","E","--",null,null,null,null,null,{"$f":"Table_2[[#This Row],[Column51]]&Table_2[[#This Row],[Column52]]&AW263","v":""}]
[261,null,null,null,null,null,null,null,null,null,null,null,null,null,null,null,null,null,null,null,"--",0,null,null,{"$f":"(K262/Instructions!$C$23)*100","v":0},{"$f":"(L262/Instructions!$C$24)*100","v":0},{"$f":"(M262/Instructions!$C$25)*100","v":0},{"$f":"(N262/Instructions!$C$26)*100","v":0},{"$f":"(O262/Instructions!$C$27)*100","v":0},{"$f":"(P262/Instructions!$C$28)*100","v":0},{"$f":"(Q262/Instructions!$C$29)*100","v":0},{"$f":"(R262/Instructions!$C$30)*100","v":0},{"$f":"(S262/Instructions!$C$31)*100","v":0},{"$f":"(T262/Instructions!$C$30)*100","v":0},{"$f":"(U262/Instructions!$C$33)*100","v":{"$error":"#VALUE!"}},"----","E","E","E","E","E","E","E","E","E","E","--",null,null,null,null,null,{"$f":"Table_2[[#This Row],[Column51]]&Table_2[[#This Row],[Column52]]&AW264","v":""}]
[262,null,null,null,null,null,null,null,null,null,null,null,null,null,null,null,null,null,null,null,"--",0,null,null,{"$f":"(K263/Instructions!$C$23)*100","v":0},{"$f":"(L263/Instructions!$C$24)*100","v":0},{"$f":"(M263/Instructions!$C$25)*100","v":0},{"$f":"(N263/Instructions!$C$26)*100","v":0},{"$f":"(O263/Instructions!$C$27)*100","v":0},{"$f":"(P263/Instructions!$C$28)*100","v":0},{"$f":"(Q263/Instructions!$C$29)*100","v":0},{"$f":"(R263/Instructions!$C$30)*100","v":0},{"$f":"(S263/Instructions!$C$31)*100","v":0},{"$f":"(T263/Instructions!$C$30)*100","v":0},{"$f":"(U263/Instructions!$C$33)*100","v":{"$error":"#VALUE!"}},"----","E","E","E","E","E","E","E","E","E","E","--",null,null,null,null,null,{"$f":"Table_2[[#This Row],[Column51]]&Table_2[[#This Row],[Column52]]&AW265","v":""}]
[263,null,null,null,null,null,null,null,null,null,null,null,null,null,null,null,null,null,null,null,"--",0,null,null,{"$f":"(K264/Instructions!$C$23)*100","v":0},{"$f":"(L264/Instructions!$C$24)*100","v":0},{"$f":"(M264/Instructions!$C$25)*100","v":0},{"$f":"(N264/Instructions!$C$26)*100","v":0},{"$f":"(O264/Instructions!$C$27)*100","v":0},{"$f":"(P264/Instructions!$C$28)*100","v":0},{"$f":"(Q264/Instructions!$C$29)*100","v":0},{"$f":"(R264/Instructions!$C$30)*100","v":0},{"$f":"(S264/Instructions!$C$31)*100","v":0},{"$f":"(T264/Instructions!$C$30)*100","v":0},{"$f":"(U264/Instructions!$C$33)*100","v":{"$error":"#VALUE!"}},"----","E","E","E","E","E","E","E","E","E","E","--",null,null,null,null,null,{"$f":"Table_2[[#This Row],[Column51]]&Table_2[[#This Row],[Column52]]&AW266","v":""}]
[264,null,null,null,null,null,null,null,null,null,null,null,null,null,null,null,null,null,null,null,"--",0,null,null,{"$f":"(K265/Instructions!$C$23)*100","v":0},{"$f":"(L265/Instructions!$C$24)*100","v":0},{"$f":"(M265/Instructions!$C$25)*100","v":0},{"$f":"(N265/Instructions!$C$26)*100","v":0},{"$f":"(O265/Instructions!$C$27)*100","v":0},{"$f":"(P265/Instructions!$C$28)*100","v":0},{"$f":"(Q265/Instructions!$C$29)*100","v":0},{"$f":"(R265/Instructions!$C$30)*100","v":0},{"$f":"(S265/Instructions!$C$31)*100","v":0},{"$f":"(T265/Instructions!$C$30)*100","v":0},{"$f":"(U265/Instructions!$C$33)*100","v":{"$error":"#VALUE!"}},"----","E","E","E","E","E","E","E","E","E","E","--",null,null,null,null,null,{"$f":"Table_2[[#This Row],[Column51]]&Table_2[[#This Row],[Column52]]&AW267","v":""}]
[265,null,null,null,null,null,null,null,null,null,null,null,null,null,null,null,null,null,null,null,"--",0,null,null,{"$f":"(K266/Instructions!$C$23)*100","v":0},{"$f":"(L266/Instructions!$C$24)*100","v":0},{"$f":"(M266/Instructions!$C$25)*100","v":0},{"$f":"(N266/Instructions!$C$26)*100","v":0},{"$f":"(O266/Instructions!$C$27)*100","v":0},{"$f":"(P266/Instructions!$C$28)*100","v":0},{"$f":"(Q266/Instructions!$C$29)*100","v":0},{"$f":"(R266/Instructions!$C$30)*100","v":0},{"$f":"(S266/Instructions!$C$31)*100","v":0},{"$f":"(T266/Instructions!$C$30)*100","v":0},{"$f":"(U266/Instructions!$C$33)*100","v":{"$error":"#VALUE!"}},"----","E","E","E","E","E","E","E","E","E","E","--",null,null,null,null,null,{"$f":"Table_2[[#This Row],[Column51]]&Table_2[[#This Row],[Column52]]&AW268","v":""}]
[266,null,null,null,null,null,null,null,null,null,null,null,null,null,null,null,null,null,null,null,"--",0,null,null,{"$f":"(K267/Instructions!$C$23)*100","v":0},{"$f":"(L267/Instructions!$C$24)*100","v":0},{"$f":"(M267/Instructions!$C$25)*100","v":0},{"$f":"(N267/Instructions!$C$26)*100","v":0},{"$f":"(O267/Instructions!$C$27)*100","v":0},{"$f":"(P267/Instructions!$C$28)*100","v":0},{"$f":"(Q267/Instructions!$C$29)*100","v":0},{"$f":"(R267/Instructions!$C$30)*100","v":0},{"$f":"(S267/Instructions!$C$31)*100","v":0},{"$f":"(T267/Instructions!$C$30)*100","v":0},{"$f":"(U267/Instructions!$C$33)*100","v":{"$error":"#VALUE!"}},"----","E","E","E","E","E","E","E","E","E","E","--",null,null,null,null,null,{"$f":"Table_2[[#This Row],[Column51]]&Table_2[[#This Row],[Column52]]&AW269","v":""}]
[267,null,null,null,null,null,null,null,null,null,null,null,null,null,null,null,null,null,null,null,"--",0,null,null,{"$f":"(K268/Instructions!$C$23)*100","v":0},{"$f":"(L268/Instructions!$C$24)*100","v":0},{"$f":"(M268/Instructions!$C$25)*100","v":0},{"$f":"(N268/Instructions!$C$26)*100","v":0},{"$f":"(O268/Instructions!$C$27)*100","v":0},{"$f":"(P268/Instructions!$C$28)*100","v":0},{"$f":"(Q268/Instructions!$C$29)*100","v":0},{"$f":"(R268/Instructions!$C$30)*100","v":0},{"$f":"(S268/Instructions!$C$31)*100","v":0},{"$f":"(T268/Instructions!$C$30)*100","v":0},{"$f":"(U268/Instructions!$C$33)*100","v":{"$error":"#VALUE!"}},"----","E","E","E","E","E","E","E","E","E","E","--",null,null,null,null,null,{"$f":"Table_2[[#This Row],[Column51]]&Table_2[[#This Row],[Column52]]&AW270","v":""}]
[268,null,null,null,null,null,null,null,null,null,null,null,null,null,null,null,null,null,null,null,"--",0,null,null,{"$f":"(K269/Instructions!$C$23)*100","v":0},{"$f":"(L269/Instructions!$C$24)*100","v":0},{"$f":"(M269/Instructions!$C$25)*100","v":0},{"$f":"(N269/Instructions!$C$26)*100","v":0},{"$f":"(O269/Instructions!$C$27)*100","v":0},{"$f":"(P269/Instructions!$C$28)*100","v":0},{"$f":"(Q269/Instructions!$C$29)*100","v":0},{"$f":"(R269/Instructions!$C$30)*100","v":0},{"$f":"(S269/Instructions!$C$31)*100","v":0},{"$f":"(T269/Instructions!$C$30)*100","v":0},{"$f":"(U269/Instructions!$C$33)*100","v":{"$error":"#VALUE!"}},"----","E","E","E","E","E","E","E","E","E","E","--",null,null,null,null,null,{"$f":"Table_2[[#This Row],[Column51]]&Table_2[[#This Row],[Column52]]&AW271","v":""}]
[269,null,null,null,null,null,null,null,null,null,null,null,null,null,null,null,null,null,null,null,"--",0,null,null,{"$f":"(K270/Instructions!$C$23)*100","v":0},{"$f":"(L270/Instructions!$C$24)*100","v":0},{"$f":"(M270/Instructions!$C$25)*100","v":0},{"$f":"(N270/Instructions!$C$26)*100","v":0},{"$f":"(O270/Instructions!$C$27)*100","v":0},{"$f":"(P270/Instructions!$C$28)*100","v":0},{"$f":"(Q270/Instructions!$C$29)*100","v":0},{"$f":"(R270/Instructions!$C$30)*100","v":0},{"$f":"(S270/Instructions!$C$31)*100","v":0},{"$f":"(T270/Instructions!$C$30)*100","v":0},{"$f":"(U270/Instructions!$C$33)*100","v":{"$error":"#VALUE!"}},"----","E","E","E","E","E","E","E","E","E","E","--",null,null,null,null,null,{"$f":"Table_2[[#This Row],[Column51]]&Table_2[[#This Row],[Column52]]&AW272","v":""}]
[270,null,null,null,null,null,null,null,null,null,null,null,null,null,null,null,null,null,null,null,"--",0,null,null,{"$f":"(K271/Instructions!$C$23)*100","v":0},{"$f":"(L271/Instructions!$C$24)*100","v":0},{"$f":"(M271/Instructions!$C$25)*100","v":0},{"$f":"(N271/Instructions!$C$26)*100","v":0},{"$f":"(O271/Instructions!$C$27)*100","v":0},{"$f":"(P271/Instructions!$C$28)*100","v":0},{"$f":"(Q271/Instructions!$C$29)*100","v":0},{"$f":"(R271/Instructions!$C$30)*100","v":0},{"$f":"(S271/Instructions!$C$31)*100","v":0},{"$f":"(T271/Instructions!$C$30)*100","v":0},{"$f":"(U271/Instructions!$C$33)*100","v":{"$error":"#VALUE!"}},"----","E","E","E","E","E","E","E","E","E","E","--",null,null,null,null,null,{"$f":"Table_2[[#This Row],[Column51]]&Table_2[[#This Row],[Column52]]&AW273","v":""}]
[271,null,null,null,null,null,null,null,null,null,null,null,null,null,null,null,null,null,null,null,"--",0,null,null,{"$f":"(K272/Instructions!$C$23)*100","v":0},{"$f":"(L272/Instructions!$C$24)*100","v":0},{"$f":"(M272/Instructions!$C$25)*100","v":0},{"$f":"(N272/Instructions!$C$26)*100","v":0},{"$f":"(O272/Instructions!$C$27)*100","v":0},{"$f":"(P272/Instructions!$C$28)*100","v":0},{"$f":"(Q272/Instructions!$C$29)*100","v":0},{"$f":"(R272/Instructions!$C$30)*100","v":0},{"$f":"(S272/Instructions!$C$31)*100","v":0},{"$f":"(T272/Instructions!$C$30)*100","v":0},{"$f":"(U272/Instructions!$C$33)*100","v":{"$error":"#VALUE!"}},"----","E","E","E","E","E","E","E","E","E","E","--",null,null,null,null,null,{"$f":"Table_2[[#This Row],[Column51]]&Table_2[[#This Row],[Column52]]&AW274","v":""}]
[272,null,null,null,null,null,null,null,null,null,null,null,null,null,null,null,null,null,null,null,"--",0,null,null,{"$f":"(K273/Instructions!$C$23)*100","v":0},{"$f":"(L273/Instructions!$C$24)*100","v":0},{"$f":"(M273/Instructions!$C$25)*100","v":0},{"$f":"(N273/Instructions!$C$26)*100","v":0},{"$f":"(O273/Instructions!$C$27)*100","v":0},{"$f":"(P273/Instructions!$C$28)*100","v":0},{"$f":"(Q273/Instructions!$C$29)*100","v":0},{"$f":"(R273/Instructions!$C$30)*100","v":0},{"$f":"(S273/Instructions!$C$31)*100","v":0},{"$f":"(T273/Instructions!$C$30)*100","v":0},{"$f":"(U273/Instructions!$C$33)*100","v":{"$error":"#VALUE!"}},"----","E","E","E","E","E","E","E","E","E","E","--",null,null,null,null,null,{"$f":"Table_2[[#This Row],[Column51]]&Table_2[[#This Row],[Column52]]&AW275","v":""}]
[273,null,null,null,null,null,null,null,null,null,null,null,null,null,null,null,null,null,null,null,"--",0,null,null,{"$f":"(K274/Instructions!$C$23)*100","v":0},{"$f":"(L274/Instructions!$C$24)*100","v":0},{"$f":"(M274/Instructions!$C$25)*100","v":0},{"$f":"(N274/Instructions!$C$26)*100","v":0},{"$f":"(O274/Instructions!$C$27)*100","v":0},{"$f":"(P274/Instructions!$C$28)*100","v":0},{"$f":"(Q274/Instructions!$C$29)*100","v":0},{"$f":"(R274/Instructions!$C$30)*100","v":0},{"$f":"(S274/Instructions!$C$31)*100","v":0},{"$f":"(T274/Instructions!$C$30)*100","v":0},{"$f":"(U274/Instructions!$C$33)*100","v":{"$error":"#VALUE!"}},"----","E","E","E","E","E","E","E","E","E","E","--",null,null,null,null,null,{"$f":"Table_2[[#This Row],[Column51]]&Table_2[[#This Row],[Column52]]&AW276","v":""}]
[274,null,null,null,null,null,null,null,null,null,null,null,null,null,null,null,null,null,null,null,"--",0,null,null,{"$f":"(K275/Instructions!$C$23)*100","v":0},{"$f":"(L275/Instructions!$C$24)*100","v":0},{"$f":"(M275/Instructions!$C$25)*100","v":0},{"$f":"(N275/Instructions!$C$26)*100","v":0},{"$f":"(O275/Instructions!$C$27)*100","v":0},{"$f":"(P275/Instructions!$C$28)*100","v":0},{"$f":"(Q275/Instructions!$C$29)*100","v":0},{"$f":"(R275/Instructions!$C$30)*100","v":0},{"$f":"(S275/Instructions!$C$31)*100","v":0},{"$f":"(T275/Instructions!$C$30)*100","v":0},{"$f":"(U275/Instructions!$C$33)*100","v":{"$error":"#VALUE!"}},"----","E","E","E","E","E","E","E","E","E","E","--",null,null,null,null,null,{"$f":"Table_2[[#This Row],[Column51]]&Table_2[[#This Row],[Column52]]&AW277","v":""}]
[275,null,null,null,null,null,null,null,null,null,null,null,null,null,null,null,null,null,null,null,"--",0,null,null,{"$f":"(K276/Instructions!$C$23)*100","v":0},{"$f":"(L276/Instructions!$C$24)*100","v":0},{"$f":"(M276/Instructions!$C$25)*100","v":0},{"$f":"(N276/Instructions!$C$26)*100","v":0},{"$f":"(O276/Instructions!$C$27)*100","v":0},{"$f":"(P276/Instructions!$C$28)*100","v":0},{"$f":"(Q276/Instructions!$C$29)*100","v":0},{"$f":"(R276/Instructions!$C$30)*100","v":0},{"$f":"(S276/Instructions!$C$31)*100","v":0},{"$f":"(T276/Instructions!$C$30)*100","v":0},{"$f":"(U276/Instructions!$C$33)*100","v":{"$error":"#VALUE!"}},"----","E","E","E","E","E","E","E","E","E","E","--",null,null,null,null,null,{"$f":"Table_2[[#This Row],[Column51]]&Table_2[[#This Row],[Column52]]&AW278","v":""}]
[276,null,null,null,null,null,null,null,null,null,null,null,null,null,null,null,null,null,null,null,"--",0,null,null,{"$f":"(K277/Instructions!$C$23)*100","v":0},{"$f":"(L277/Instructions!$C$24)*100","v":0},{"$f":"(M277/Instructions!$C$25)*100","v":0},{"$f":"(N277/Instructions!$C$26)*100","v":0},{"$f":"(O277/Instructions!$C$27)*100","v":0},{"$f":"(P277/Instructions!$C$28)*100","v":0},{"$f":"(Q277/Instructions!$C$29)*100","v":0},{"$f":"(R277/Instructions!$C$30)*100","v":0},{"$f":"(S277/Instructions!$C$31)*100","v":0},{"$f":"(T277/Instructions!$C$30)*100","v":0},{"$f":"(U277/Instructions!$C$33)*100","v":{"$error":"#VALUE!"}},"----","E","E","E","E","E","E","E","E","E","E","--",null,null,null,null,null,{"$f":"Table_2[[#This Row],[Column51]]&Table_2[[#This Row],[Column52]]&AW279","v":""}]
[277,null,null,null,null,null,null,null,null,null,null,null,null,null,null,null,null,null,null,null,"--",0,null,null,{"$f":"(K278/Instructions!$C$23)*100","v":0},{"$f":"(L278/Instructions!$C$24)*100","v":0},{"$f":"(M278/Instructions!$C$25)*100","v":0},{"$f":"(N278/Instructions!$C$26)*100","v":0},{"$f":"(O278/Instructions!$C$27)*100","v":0},{"$f":"(P278/Instructions!$C$28)*100","v":0},{"$f":"(Q278/Instructions!$C$29)*100","v":0},{"$f":"(R278/Instructions!$C$30)*100","v":0},{"$f":"(S278/Instructions!$C$31)*100","v":0},{"$f":"(T278/Instructions!$C$30)*100","v":0},{"$f":"(U278/Instructions!$C$33)*100","v":{"$error":"#VALUE!"}},"----","E","E","E","E","E","E","E","E","E","E","--",null,null,null,null,null,{"$f":"Table_2[[#This Row],[Column51]]&Table_2[[#This Row],[Column52]]&AW280","v":""}]
[278,null,null,null,null,null,null,null,null,null,null,null,null,null,null,null,null,null,null,null,"--",0,null,null,{"$f":"(K279/Instructions!$C$23)*100","v":0},{"$f":"(L279/Instructions!$C$24)*100","v":0},{"$f":"(M279/Instructions!$C$25)*100","v":0},{"$f":"(N279/Instructions!$C$26)*100","v":0},{"$f":"(O279/Instructions!$C$27)*100","v":0},{"$f":"(P279/Instructions!$C$28)*100","v":0},{"$f":"(Q279/Instructions!$C$29)*100","v":0},{"$f":"(R279/Instructions!$C$30)*100","v":0},{"$f":"(S279/Instructions!$C$31)*100","v":0},{"$f":"(T279/Instructions!$C$30)*100","v":0},{"$f":"(U279/Instructions!$C$33)*100","v":{"$error":"#VALUE!"}},"----","E","E","E","E","E","E","E","E","E","E","--",null,null,null,null,null,{"$f":"Table_2[[#This Row],[Column51]]&Table_2[[#This Row],[Column52]]&AW281","v":""}]
[279,null,null,null,null,null,null,null,null,null,null,null,null,null,null,null,null,null,null,null,"--",0,null,null,{"$f":"(K280/Instructions!$C$23)*100","v":0},{"$f":"(L280/Instructions!$C$24)*100","v":0},{"$f":"(M280/Instructions!$C$25)*100","v":0},{"$f":"(N280/Instructions!$C$26)*100","v":0},{"$f":"(O280/Instructions!$C$27)*100","v":0},{"$f":"(P280/Instructions!$C$28)*100","v":0},{"$f":"(Q280/Instructions!$C$29)*100","v":0},{"$f":"(R280/Instructions!$C$30)*100","v":0},{"$f":"(S280/Instructions!$C$31)*100","v":0},{"$f":"(T280/Instructions!$C$30)*100","v":0},{"$f":"(U280/Instructions!$C$33)*100","v":{"$error":"#VALUE!"}},"----","E","E","E","E","E","E","E","E","E","E","--",null,null,null,null,null,{"$f":"Table_2[[#This Row],[Column51]]&Table_2[[#This Row],[Column52]]&AW282","v":""}]
[280,null,null,null,null,null,null,null,null,null,null,null,null,null,null,null,null,null,null,null,"--",0,null,null,{"$f":"(K281/Instructions!$C$23)*100","v":0},{"$f":"(L281/Instructions!$C$24)*100","v":0},{"$f":"(M281/Instructions!$C$25)*100","v":0},{"$f":"(N281/Instructions!$C$26)*100","v":0},{"$f":"(O281/Instructions!$C$27)*100","v":0},{"$f":"(P281/Instructions!$C$28)*100","v":0},{"$f":"(Q281/Instructions!$C$29)*100","v":0},{"$f":"(R281/Instructions!$C$30)*100","v":0},{"$f":"(S281/Instructions!$C$31)*100","v":0},{"$f":"(T281/Instructions!$C$30)*100","v":0},{"$f":"(U281/Instructions!$C$33)*100","v":{"$error":"#VALUE!"}},"----","E","E","E","E","E","E","E","E","E","E","--",null,null,null,null,null,{"$f":"Table_2[[#This Row],[Column51]]&Table_2[[#This Row],[Column52]]&AW283","v":""}]
[281,null,null,null,null,null,null,null,null,null,null,null,null,null,null,null,null,null,null,null,"--",0,null,null,{"$f":"(K282/Instructions!$C$23)*100","v":0},{"$f":"(L282/Instructions!$C$24)*100","v":0},{"$f":"(M282/Instructions!$C$25)*100","v":0},{"$f":"(N282/Instructions!$C$26)*100","v":0},{"$f":"(O282/Instructions!$C$27)*100","v":0},{"$f":"(P282/Instructions!$C$28)*100","v":0},{"$f":"(Q282/Instructions!$C$29)*100","v":0},{"$f":"(R282/Instructions!$C$30)*100","v":0},{"$f":"(S282/Instructions!$C$31)*100","v":0},{"$f":"(T282/Instructions!$C$30)*100","v":0},{"$f":"(U282/Instructions!$C$33)*100","v":{"$error":"#VALUE!"}},"----","E","E","E","E","E","E","E","E","E","E","--",null,null,null,null,null,{"$f":"Table_2[[#This Row],[Column51]]&Table_2[[#This Row],[Column52]]&AW284","v":""}]
[282,null,null,null,null,null,null,null,null,null,null,null,null,null,null,null,null,null,null,null,"--",0,null,null,{"$f":"(K283/Instructions!$C$23)*100","v":0},{"$f":"(L283/Instructions!$C$24)*100","v":0},{"$f":"(M283/Instructions!$C$25)*100","v":0},{"$f":"(N283/Instructions!$C$26)*100","v":0},{"$f":"(O283/Instructions!$C$27)*100","v":0},{"$f":"(P283/Instructions!$C$28)*100","v":0},{"$f":"(Q283/Instructions!$C$29)*100","v":0},{"$f":"(R283/Instructions!$C$30)*100","v":0},{"$f":"(S283/Instructions!$C$31)*100","v":0},{"$f":"(T283/Instructions!$C$30)*100","v":0},{"$f":"(U283/Instructions!$C$33)*100","v":{"$error":"#VALUE!"}},"----","E","E","E","E","E","E","E","E","E","E","--",null,null,null,null,null,{"$f":"Table_2[[#This Row],[Column51]]&Table_2[[#This Row],[Column52]]&AW285","v":""}]
[283,null,null,null,null,null,null,null,null,null,null,null,null,null,null,null,null,null,null,null,"--",0,null,null,{"$f":"(K284/Instructions!$C$23)*100","v":0},{"$f":"(L284/Instructions!$C$24)*100","v":0},{"$f":"(M284/Instructions!$C$25)*100","v":0},{"$f":"(N284/Instructions!$C$26)*100","v":0},{"$f":"(O284/Instructions!$C$27)*100","v":0},{"$f":"(P284/Instructions!$C$28)*100","v":0},{"$f":"(Q284/Instructions!$C$29)*100","v":0},{"$f":"(R284/Instructions!$C$30)*100","v":0},{"$f":"(S284/Instructions!$C$31)*100","v":0},{"$f":"(T284/Instructions!$C$30)*100","v":0},{"$f":"(U284/Instructions!$C$33)*100","v":{"$error":"#VALUE!"}},"----","E","E","E","E","E","E","E","E","E","E","--",null,null,null,null,null,{"$f":"Table_2[[#This Row],[Column51]]&Table_2[[#This Row],[Column52]]&AW286","v":""}]
[284,null,null,null,null,null,null,null,null,null,null,null,null,null,null,null,null,null,null,null,"--",0,null,null,{"$f":"(K285/Instructions!$C$23)*100","v":0},{"$f":"(L285/Instructions!$C$24)*100","v":0},{"$f":"(M285/Instructions!$C$25)*100","v":0},{"$f":"(N285/Instructions!$C$26)*100","v":0},{"$f":"(O285/Instructions!$C$27)*100","v":0},{"$f":"(P285/Instructions!$C$28)*100","v":0},{"$f":"(Q285/Instructions!$C$29)*100","v":0},{"$f":"(R285/Instructions!$C$30)*100","v":0},{"$f":"(S285/Instructions!$C$31)*100","v":0},{"$f":"(T285/Instructions!$C$30)*100","v":0},{"$f":"(U285/Instructions!$C$33)*100","v":{"$error":"#VALUE!"}},"----","E","E","E","E","E","E","E","E","E","E","--",null,null,null,null,null,{"$f":"Table_2[[#This Row],[Column51]]&Table_2[[#This Row],[Column52]]&AW287","v":""}]
[285,null,null,null,null,null,null,null,null,null,null,null,null,null,null,null,null,null,null,null,"--",0,null,null,{"$f":"(K286/Instructions!$C$23)*100","v":0},{"$f":"(L286/Instructions!$C$24)*100","v":0},{"$f":"(M286/Instructions!$C$25)*100","v":0},{"$f":"(N286/Instructions!$C$26)*100","v":0},{"$f":"(O286/Instructions!$C$27)*100","v":0},{"$f":"(P286/Instructions!$C$28)*100","v":0},{"$f":"(Q286/Instructions!$C$29)*100","v":0},{"$f":"(R286/Instructions!$C$30)*100","v":0},{"$f":"(S286/Instructions!$C$31)*100","v":0},{"$f":"(T286/Instructions!$C$30)*100","v":0},{"$f":"(U286/Instructions!$C$33)*100","v":{"$error":"#VALUE!"}},"----","E","E","E","E","E","E","E","E","E","E","--",null,null,null,null,null,{"$f":"Table_2[[#This Row],[Column51]]&Table_2[[#This Row],[Column52]]&AW288","v":""}]
[286,null,null,null,null,null,null,null,null,null,null,null,null,null,null,null,null,null,null,null,"--",0,null,null,{"$f":"(K287/Instructions!$C$23)*100","v":0},{"$f":"(L287/Instructions!$C$24)*100","v":0},{"$f":"(M287/Instructions!$C$25)*100","v":0},{"$f":"(N287/Instructions!$C$26)*100","v":0},{"$f":"(O287/Instructions!$C$27)*100","v":0},{"$f":"(P287/Instructions!$C$28)*100","v":0},{"$f":"(Q287/Instructions!$C$29)*100","v":0},{"$f":"(R287/Instructions!$C$30)*100","v":0},{"$f":"(S287/Instructions!$C$31)*100","v":0},{"$f":"(T287/Instructions!$C$30)*100","v":0},{"$f":"(U287/Instructions!$C$33)*100","v":{"$error":"#VALUE!"}},"----","E","E","E","E","E","E","E","E","E","E","--",null,null,null,null,null,{"$f":"Table_2[[#This Row],[Column51]]&Table_2[[#This Row],[Column52]]&AW289","v":""}]
[287,null,null,null,null,null,null,null,null,null,null,null,null,null,null,null,null,null,null,null,"--",0,null,null,{"$f":"(K288/Instructions!$C$23)*100","v":0},{"$f":"(L288/Instructions!$C$24)*100","v":0},{"$f":"(M288/Instructions!$C$25)*100","v":0},{"$f":"(N288/Instructions!$C$26)*100","v":0},{"$f":"(O288/Instructions!$C$27)*100","v":0},{"$f":"(P288/Instructions!$C$28)*100","v":0},{"$f":"(Q288/Instructions!$C$29)*100","v":0},{"$f":"(R288/Instructions!$C$30)*100","v":0},{"$f":"(S288/Instructions!$C$31)*100","v":0},{"$f":"(T288/Instructions!$C$30)*100","v":0},{"$f":"(U288/Instructions!$C$33)*100","v":{"$error":"#VALUE!"}},"----","E","E","E","E","E","E","E","E","E","E","--",null,null,null,null,null,{"$f":"Table_2[[#This Row],[Column51]]&Table_2[[#This Row],[Column52]]&AW290","v":""}]
[288,null,null,null,null,null,null,null,null,null,null,null,null,null,null,null,null,null,null,null,"--",0,null,null,{"$f":"(K289/Instructions!$C$23)*100","v":0},{"$f":"(L289/Instructions!$C$24)*100","v":0},{"$f":"(M289/Instructions!$C$25)*100","v":0},{"$f":"(N289/Instructions!$C$26)*100","v":0},{"$f":"(O289/Instructions!$C$27)*100","v":0},{"$f":"(P289/Instructions!$C$28)*100","v":0},{"$f":"(Q289/Instructions!$C$29)*100","v":0},{"$f":"(R289/Instructions!$C$30)*100","v":0},{"$f":"(S289/Instructions!$C$31)*100","v":0},{"$f":"(T289/Instructions!$C$30)*100","v":0},{"$f":"(U289/Instructions!$C$33)*100","v":{"$error":"#VALUE!"}},"----","E","E","E","E","E","E","E","E","E","E","--",null,null,null,null,null,{"$f":"Table_2[[#This Row],[Column51]]&Table_2[[#This Row],[Column52]]&AW291","v":""}]
[289,null,null,null,null,null,null,null,null,null,null,null,null,null,null,null,null,null,null,null,"--",0,null,null,{"$f":"(K290/Instructions!$C$23)*100","v":0},{"$f":"(L290/Instructions!$C$24)*100","v":0},{"$f":"(M290/Instructions!$C$25)*100","v":0},{"$f":"(N290/Instructions!$C$26)*100","v":0},{"$f":"(O290/Instructions!$C$27)*100","v":0},{"$f":"(P290/Instructions!$C$28)*100","v":0},{"$f":"(Q290/Instructions!$C$29)*100","v":0},{"$f":"(R290/Instructions!$C$30)*100","v":0},{"$f":"(S290/Instructions!$C$31)*100","v":0},{"$f":"(T290/Instructions!$C$30)*100","v":0},{"$f":"(U290/Instructions!$C$33)*100","v":{"$error":"#VALUE!"}},"----","E","E","E","E","E","E","E","E","E","E","--",null,null,null,null,null,{"$f":"Table_2[[#This Row],[Column51]]&Table_2[[#This Row],[Column52]]&AW292","v":""}]
[290,null,null,null,null,null,null,null,null,null,null,null,null,null,null,null,null,null,null,null,"--",0,null,null,{"$f":"(K291/Instructions!$C$23)*100","v":0},{"$f":"(L291/Instructions!$C$24)*100","v":0},{"$f":"(M291/Instructions!$C$25)*100","v":0},{"$f":"(N291/Instructions!$C$26)*100","v":0},{"$f":"(O291/Instructions!$C$27)*100","v":0},{"$f":"(P291/Instructions!$C$28)*100","v":0},{"$f":"(Q291/Instructions!$C$29)*100","v":0},{"$f":"(R291/Instructions!$C$30)*100","v":0},{"$f":"(S291/Instructions!$C$31)*100","v":0},{"$f":"(T291/Instructions!$C$30)*100","v":0},{"$f":"(U291/Instructions!$C$33)*100","v":{"$error":"#VALUE!"}},"----","E","E","E","E","E","E","E","E","E","E","--",null,null,null,null,null,{"$f":"Table_2[[#This Row],[Column51]]&Table_2[[#This Row],[Column52]]&AW293","v":""}]
[291,null,null,null,null,null,null,null,null,null,null,null,null,null,null,null,null,null,null,null,"--",0,null,null,{"$f":"(K292/Instructions!$C$23)*100","v":0},{"$f":"(L292/Instructions!$C$24)*100","v":0},{"$f":"(M292/Instructions!$C$25)*100","v":0},{"$f":"(N292/Instructions!$C$26)*100","v":0},{"$f":"(O292/Instructions!$C$27)*100","v":0},{"$f":"(P292/Instructions!$C$28)*100","v":0},{"$f":"(Q292/Instructions!$C$29)*100","v":0},{"$f":"(R292/Instructions!$C$30)*100","v":0},{"$f":"(S292/Instructions!$C$31)*100","v":0},{"$f":"(T292/Instructions!$C$30)*100","v":0},{"$f":"(U292/Instructions!$C$33)*100","v":{"$error":"#VALUE!"}},"----","E","E","E","E","E","E","E","E","E","E","--",null,null,null,null,null,{"$f":"Table_2[[#This Row],[Column51]]&Table_2[[#This Row],[Column52]]&AW294","v":""}]
[292,null,null,null,null,null,null,null,null,null,null,null,null,null,null,null,null,null,null,null,"--",0,null,null,{"$f":"(K293/Instructions!$C$23)*100","v":0},{"$f":"(L293/Instructions!$C$24)*100","v":0},{"$f":"(M293/Instructions!$C$25)*100","v":0},{"$f":"(N293/Instructions!$C$26)*100","v":0},{"$f":"(O293/Instructions!$C$27)*100","v":0},{"$f":"(P293/Instructions!$C$28)*100","v":0},{"$f":"(Q293/Instructions!$C$29)*100","v":0},{"$f":"(R293/Instructions!$C$30)*100","v":0},{"$f":"(S293/Instructions!$C$31)*100","v":0},{"$f":"(T293/Instructions!$C$30)*100","v":0},{"$f":"(U293/Instructions!$C$33)*100","v":{"$error":"#VALUE!"}},"----","E","E","E","E","E","E","E","E","E","E","--",null,null,null,null,null,{"$f":"Table_2[[#This Row],[Column51]]&Table_2[[#This Row],[Column52]]&AW295","v":""}]
[293,null,null,null,null,null,null,null,null,null,null,null,null,null,null,null,null,null,null,null,"--",0,null,null,{"$f":"(K294/Instructions!$C$23)*100","v":0},{"$f":"(L294/Instructions!$C$24)*100","v":0},{"$f":"(M294/Instructions!$C$25)*100","v":0},{"$f":"(N294/Instructions!$C$26)*100","v":0},{"$f":"(O294/Instructions!$C$27)*100","v":0},{"$f":"(P294/Instructions!$C$28)*100","v":0},{"$f":"(Q294/Instructions!$C$29)*100","v":0},{"$f":"(R294/Instructions!$C$30)*100","v":0},{"$f":"(S294/Instructions!$C$31)*100","v":0},{"$f":"(T294/Instructions!$C$30)*100","v":0},{"$f":"(U294/Instructions!$C$33)*100","v":{"$error":"#VALUE!"}},"----","E","E","E","E","E","E","E","E","E","E","--",null,null,null,null,null,{"$f":"Table_2[[#This Row],[Column51]]&Table_2[[#This Row],[Column52]]&AW296","v":""}]
[294,null,null,null,null,null,null,null,null,null,null,null,null,null,null,null,null,null,null,null,"--",0,null,null,{"$f":"(K295/Instructions!$C$23)*100","v":0},{"$f":"(L295/Instructions!$C$24)*100","v":0},{"$f":"(M295/Instructions!$C$25)*100","v":0},{"$f":"(N295/Instructions!$C$26)*100","v":0},{"$f":"(O295/Instructions!$C$27)*100","v":0},{"$f":"(P295/Instructions!$C$28)*100","v":0},{"$f":"(Q295/Instructions!$C$29)*100","v":0},{"$f":"(R295/Instructions!$C$30)*100","v":0},{"$f":"(S295/Instructions!$C$31)*100","v":0},{"$f":"(T295/Instructions!$C$30)*100","v":0},{"$f":"(U295/Instructions!$C$33)*100","v":{"$error":"#VALUE!"}},"----","E","E","E","E","E","E","E","E","E","E","--",null,null,null,null,null,{"$f":"Table_2[[#This Row],[Column51]]&Table_2[[#This Row],[Column52]]&AW297","v":""}]
[295,null,null,null,null,null,null,null,null,null,null,null,null,null,null,null,null,null,null,null,"--",0,null,null,{"$f":"(K296/Instructions!$C$23)*100","v":0},{"$f":"(L296/Instructions!$C$24)*100","v":0},{"$f":"(M296/Instructions!$C$25)*100","v":0},{"$f":"(N296/Instructions!$C$26)*100","v":0},{"$f":"(O296/Instructions!$C$27)*100","v":0},{"$f":"(P296/Instructions!$C$28)*100","v":0},{"$f":"(Q296/Instructions!$C$29)*100","v":0},{"$f":"(R296/Instructions!$C$30)*100","v":0},{"$f":"(S296/Instructions!$C$31)*100","v":0},{"$f":"(T296/Instructions!$C$30)*100","v":0},{"$f":"(U296/Instructions!$C$33)*100","v":{"$error":"#VALUE!"}},"----","E","E","E","E","E","E","E","E","E","E","--",null,null,null,null,null,{"$f":"Table_2[[#This Row],[Column51]]&Table_2[[#This Row],[Column52]]&AW298","v":""}]
[296,null,null,null,null,null,null,null,null,null,null,null,null,null,null,null,null,null,null,null,"--",0,null,null,{"$f":"(K297/Instructions!$C$23)*100","v":0},{"$f":"(L297/Instructions!$C$24)*100","v":0},{"$f":"(M297/Instructions!$C$25)*100","v":0},{"$f":"(N297/Instructions!$C$26)*100","v":0},{"$f":"(O297/Instructions!$C$27)*100","v":0},{"$f":"(P297/Instructions!$C$28)*100","v":0},{"$f":"(Q297/Instructions!$C$29)*100","v":0},{"$f":"(R297/Instructions!$C$30)*100","v":0},{"$f":"(S297/Instructions!$C$31)*100","v":0},{"$f":"(T297/Instructions!$C$30)*100","v":0},{"$f":"(U297/Instructions!$C$33)*100","v":{"$error":"#VALUE!"}},"----","E","E","E","E","E","E","E","E","E","E","--",null,null,null,null,null,{"$f":"Table_2[[#This Row],[Column51]]&Table_2[[#This Row],[Column52]]&AW299","v":""}]
[297,null,null,null,null,null,null,null,null,null,null,null,null,null,null,null,null,null,null,null,"--",0,null,null,{"$f":"(K298/Instructions!$C$23)*100","v":0},{"$f":"(L298/Instructions!$C$24)*100","v":0},{"$f":"(M298/Instructions!$C$25)*100","v":0},{"$f":"(N298/Instructions!$C$26)*100","v":0},{"$f":"(O298/Instructions!$C$27)*100","v":0},{"$f":"(P298/Instructions!$C$28)*100","v":0},{"$f":"(Q298/Instructions!$C$29)*100","v":0},{"$f":"(R298/Instructions!$C$30)*100","v":0},{"$f":"(S298/Instructions!$C$31)*100","v":0},{"$f":"(T298/Instructions!$C$30)*100","v":0},{"$f":"(U298/Instructions!$C$33)*100","v":{"$error":"#VALUE!"}},"----","E","E","E","E","E","E","E","E","E","E","--",null,null,null,null,null,{"$f":"Table_2[[#This Row],[Column51]]&Table_2[[#This Row],[Column52]]&AW300","v":""}]
[298,null,null,null,null,null,null,null,null,null,null,null,null,null,null,null,null,null,null,null,"--",0,null,null,{"$f":"(K299/Instructions!$C$23)*100","v":0},{"$f":"(L299/Instructions!$C$24)*100","v":0},{"$f":"(M299/Instructions!$C$25)*100","v":0},{"$f":"(N299/Instructions!$C$26)*100","v":0},{"$f":"(O299/Instructions!$C$27)*100","v":0},{"$f":"(P299/Instructions!$C$28)*100","v":0},{"$f":"(Q299/Instructions!$C$29)*100","v":0},{"$f":"(R299/Instructions!$C$30)*100","v":0},{"$f":"(S299/Instructions!$C$31)*100","v":0},{"$f":"(T299/Instructions!$C$30)*100","v":0},{"$f":"(U299/Instructions!$C$33)*100","v":{"$error":"#VALUE!"}},"----","E","E","E","E","E","E","E","E","E","E","--",null,null,null,null,null,{"$f":"Table_2[[#This Row],[Column51]]&Table_2[[#This Row],[Column52]]&AW301","v":""}]
[299,null,null,null,null,null,null,null,null,null,null,null,null,null,null,null,null,null,null,null,"--",0,null,null,{"$f":"(K300/Instructions!$C$23)*100","v":0},{"$f":"(L300/Instructions!$C$24)*100","v":0},{"$f":"(M300/Instructions!$C$25)*100","v":0},{"$f":"(N300/Instructions!$C$26)*100","v":0},{"$f":"(O300/Instructions!$C$27)*100","v":0},{"$f":"(P300/Instructions!$C$28)*100","v":0},{"$f":"(Q300/Instructions!$C$29)*100","v":0},{"$f":"(R300/Instructions!$C$30)*100","v":0},{"$f":"(S300/Instructions!$C$31)*100","v":0},{"$f":"(T300/Instructions!$C$30)*100","v":0},{"$f":"(U300/Instructions!$C$33)*100","v":{"$error":"#VALUE!"}},"----","E","E","E","E","E","E","E","E","E","E","--",null,null,null,null,null,{"$f":"Table_2[[#This Row],[Column51]]&Table_2[[#This Row],[Column52]]&AW302","v":""}]
[300,null,null,null,null,null,null,null,null,null,null,null,null,null,null,null,null,null,null,null,"--",0,null,null,{"$f":"(K301/Instructions!$C$23)*100","v":0},{"$f":"(L301/Instructions!$C$24)*100","v":0},{"$f":"(M301/Instructions!$C$25)*100","v":0},{"$f":"(N301/Instructions!$C$26)*100","v":0},{"$f":"(O301/Instructions!$C$27)*100","v":0},{"$f":"(P301/Instructions!$C$28)*100","v":0},{"$f":"(Q301/Instructions!$C$29)*100","v":0},{"$f":"(R301/Instructions!$C$30)*100","v":0},{"$f":"(S301/Instructions!$C$31)*100","v":0},{"$f":"(T301/Instructions!$C$30)*100","v":0},{"$f":"(U301/Instructions!$C$33)*100","v":{"$error":"#VALUE!"}},"----","E","E","E","E","E","E","E","E","E","E","--",null,null,null,null,null,{"$f":"Table_2[[#This Row],[Column51]]&Table_2[[#This Row],[Column52]]&AW303","v":""}]
[301,null,null,null,null,null,null,null,null,null,null,null,null,null,null,null,null,null,null,null,"--",0,null,null,{"$f":"(K302/Instructions!$C$23)*100","v":0},{"$f":"(L302/Instructions!$C$24)*100","v":0},{"$f":"(M302/Instructions!$C$25)*100","v":0},{"$f":"(N302/Instructions!$C$26)*100","v":0},{"$f":"(O302/Instructions!$C$27)*100","v":0},{"$f":"(P302/Instructions!$C$28)*100","v":0},{"$f":"(Q302/Instructions!$C$29)*100","v":0},{"$f":"(R302/Instructions!$C$30)*100","v":0},{"$f":"(S302/Instructions!$C$31)*100","v":0},{"$f":"(T302/Instructions!$C$30)*100","v":0},{"$f":"(U302/Instructions!$C$33)*100","v":{"$error":"#VALUE!"}},"----","E","E","E","E","E","E","E","E","E","E","--",null,null,null,null,null,{"$f":"Table_2[[#This Row],[Column51]]&Table_2[[#This Row],[Column52]]&AW304","v":""}]
[302,null,null,null,null,null,null,null,null,null,null,null,null,null,null,null,null,null,null,null,"--",0,null,null,{"$f":"(K303/Instructions!$C$23)*100","v":0},{"$f":"(L303/Instructions!$C$24)*100","v":0},{"$f":"(M303/Instructions!$C$25)*100","v":0},{"$f":"(N303/Instructions!$C$26)*100","v":0},{"$f":"(O303/Instructions!$C$27)*100","v":0},{"$f":"(P303/Instructions!$C$28)*100","v":0},{"$f":"(Q303/Instructions!$C$29)*100","v":0},{"$f":"(R303/Instructions!$C$30)*100","v":0},{"$f":"(S303/Instructions!$C$31)*100","v":0},{"$f":"(T303/Instructions!$C$30)*100","v":0},{"$f":"(U303/Instructions!$C$33)*100","v":{"$error":"#VALUE!"}},"----","E","E","E","E","E","E","E","E","E","E","--",null,null,null,null,null,{"$f":"Table_2[[#This Row],[Column51]]&Table_2[[#This Row],[Column52]]&AW305","v":""}]
[303,null,null,null,null,null,null,null,null,null,null,null,null,null,null,null,null,null,null,null,"--",0,null,null,{"$f":"(K304/Instructions!$C$23)*100","v":0},{"$f":"(L304/Instructions!$C$24)*100","v":0},{"$f":"(M304/Instructions!$C$25)*100","v":0},{"$f":"(N304/Instructions!$C$26)*100","v":0},{"$f":"(O304/Instructions!$C$27)*100","v":0},{"$f":"(P304/Instructions!$C$28)*100","v":0},{"$f":"(Q304/Instructions!$C$29)*100","v":0},{"$f":"(R304/Instructions!$C$30)*100","v":0},{"$f":"(S304/Instructions!$C$31)*100","v":0},{"$f":"(T304/Instructions!$C$30)*100","v":0},{"$f":"(U304/Instructions!$C$33)*100","v":{"$error":"#VALUE!"}},"----","E","E","E","E","E","E","E","E","E","E","--",null,null,null,null,null,{"$f":"Table_2[[#This Row],[Column51]]&Table_2[[#This Row],[Column52]]&AW306","v":""}]
[304,null,null,null,null,null,null,null,null,null,null,null,null,null,null,null,null,null,null,null,"--",0,null,null,{"$f":"(K305/Instructions!$C$23)*100","v":0},{"$f":"(L305/Instructions!$C$24)*100","v":0},{"$f":"(M305/Instructions!$C$25)*100","v":0},{"$f":"(N305/Instructions!$C$26)*100","v":0},{"$f":"(O305/Instructions!$C$27)*100","v":0},{"$f":"(P305/Instructions!$C$28)*100","v":0},{"$f":"(Q305/Instructions!$C$29)*100","v":0},{"$f":"(R305/Instructions!$C$30)*100","v":0},{"$f":"(S305/Instructions!$C$31)*100","v":0},{"$f":"(T305/Instructions!$C$30)*100","v":0},{"$f":"(U305/Instructions!$C$33)*100","v":{"$error":"#VALUE!"}},"----","E","E","E","E","E","E","E","E","E","E","--",null,null,null,null,null,{"$f":"Table_2[[#This Row],[Column51]]&Table_2[[#This Row],[Column52]]&AW307","v":""}]
[305,null,null,null,null,null,null,null,null,null,null,null,null,null,null,null,null,null,null,null,"--",0,null,null,{"$f":"(K306/Instructions!$C$23)*100","v":0},{"$f":"(L306/Instructions!$C$24)*100","v":0},{"$f":"(M306/Instructions!$C$25)*100","v":0},{"$f":"(N306/Instructions!$C$26)*100","v":0},{"$f":"(O306/Instructions!$C$27)*100","v":0},{"$f":"(P306/Instructions!$C$28)*100","v":0},{"$f":"(Q306/Instructions!$C$29)*100","v":0},{"$f":"(R306/Instructions!$C$30)*100","v":0},{"$f":"(S306/Instructions!$C$31)*100","v":0},{"$f":"(T306/Instructions!$C$30)*100","v":0},{"$f":"(U306/Instructions!$C$33)*100","v":{"$error":"#VALUE!"}},"----","E","E","E","E","E","E","E","E","E","E","--",null,null,null,null,null,{"$f":"Table_2[[#This Row],[Column51]]&Table_2[[#This Row],[Column52]]&AW308","v":""}]
[306,null,null,null,null,null,null,null,null,null,null,null,null,null,null,null,null,null,null,null,"--",0,null,null,{"$f":"(K307/Instructions!$C$23)*100","v":0},{"$f":"(L307/Instructions!$C$24)*100","v":0},{"$f":"(M307/Instructions!$C$25)*100","v":0},{"$f":"(N307/Instructions!$C$26)*100","v":0},{"$f":"(O307/Instructions!$C$27)*100","v":0},{"$f":"(P307/Instructions!$C$28)*100","v":0},{"$f":"(Q307/Instructions!$C$29)*100","v":0},{"$f":"(R307/Instructions!$C$30)*100","v":0},{"$f":"(S307/Instructions!$C$31)*100","v":0},{"$f":"(T307/Instructions!$C$30)*100","v":0},{"$f":"(U307/Instructions!$C$33)*100","v":{"$error":"#VALUE!"}},{"$f":"IF(AND(Y307>=33,Z307>=33,AA307>=33,AB307>=33,AC307>=33,AD307>=33),\"PASS\",\"----\")","v":"----"},"E","E","E","E","E","E","E","E","E","E","--",null,null,null,null,null,{"$f":"Table_2[[#This Row],[Column51]]&Table_2[[#This Row],[Column52]]&AW309","v":""}]
[307,null,null,null,null,null,null,null,null,null,null,null,null,null,null,null,null,null,null,null,"--",0,null,null,{"$f":"(K308/Instructions!$C$23)*100","v":0},{"$f":"(L308/Instructions!$C$24)*100","v":0},{"$f":"(M308/Instructions!$C$25)*100","v":0},{"$f":"(N308/Instructions!$C$26)*100","v":0},{"$f":"(O308/Instructions!$C$27)*100","v":0},{"$f":"(P308/Instructions!$C$28)*100","v":0},{"$f":"(Q308/Instructions!$C$29)*100","v":0},{"$f":"(R308/Instructions!$C$30)*100","v":0},{"$f":"(S308/Instructions!$C$31)*100","v":0},{"$f":"(T308/Instructions!$C$30)*100","v":0},{"$f":"(U308/Instructions!$C$33)*100","v":{"$error":"#VALUE!"}},"----",{"$f":"IFERROR(IF(Y308>90,\"A+\",IF(Y308>80,\"A\",IF(Y308>70,\"B+\",IF(Y308>60,\"B\",IF(Y308>50,\"C+\",IF(Y308>40,\"C\",IF(Y308>=33,\"D\",\"E\"))))))),\"Abs\")","v":"E"},{"$f":"IFERROR(IF(Z308>90,\"A+\",IF(Z308>80,\"A\",IF(Z308>70,\"B+\",IF(Z308>60,\"B\",IF(Z308>50,\"C+\",IF(Z308>40,\"C\",IF(Z308>=33,\"D\",\"E\"))))))),\"Abs\")","v":"E"},{"$f":"IFERROR(IF(AA308>90,\"A+\",IF(AA308>80,\"A\",IF(AA308>70,\"B+\",IF(AA308>60,\"B\",IF(AA308>50,\"C+\",IF(AA308>40,\"C\",IF(AA308>=33,\"D\",\"E\"))))))),\"Abs\")","v":"E"},{"$f":"IFERROR(IF(AB308>90,\"A+\",IF(AB308>80,\"A\",IF(AB308>70,\"B+\",IF(AB308>60,\"B\",IF(AB308>50,\"C+\",IF(AB308>40,\"C\",IF(AB308>=33,\"D\",\"E\"))))))),\"Abs\")","v":"E"},{"$f":"IFERROR(IF(AC308>90,\"A+\",IF(AC308>80,\"A\",IF(AC308>70,\"B+\",IF(AC308>60,\"B\",IF(AC308>50,\"C+\",IF(AC308>40,\"C\",IF(AC308>=33,\"D\",\"E\"))))))),\"Abs\")","v":"E"},{"$f":"IFERROR(IF(AD308>90,\"A+\",IF(AD308>80,\"A\",IF(AD308>70,\"B+\",IF(AD308>60,\"B\",IF(AD308>50,\"C+\",IF(AD308>40,\"C\",IF(AD308>=33,\"D\",\"E\"))))))),\"Abs\")","v":"E"},{"$f":"IFERROR(IF(AE308>90,\"A+\",IF(AE308>80,\"A\",IF(AE308>70,\"B+\",IF(AE308>60,\"B\",IF(AE308>50,\"C+\",IF(AE308>40,\"C\",IF(AE308>=33,\"D\",\"E\"))))))),\"Abs\")","v":"E"},{"$f":"IFERROR(IF(AF308>90,\"A+\",IF(AF308>80,\"A\",IF(AF308>70,\"B+\",IF(AF308>60,\"B\",IF(AF308>50,\"C+\",IF(AF308>40,\"C\",IF(AF308>=33,\"D\",\"E\"))))))),\"Abs\")","v":"E"},{"$f":"IFERROR(IF(AG308>90,\"A+\",IF(AG308>80,\"A\",IF(AG308>70,\"B+\",IF(AG308>60,\"B\",IF(AG308>50,\"C+\",IF(AG308>40,\"C\",IF(AG308>=33,\"D\",\"E\"))))))),\"Abs\")","v":"E"},{"$f":"IFERROR(IF(AH308>90,\"A+\",IF(AH308>80,\"A\",IF(AH308>70,\"B+\",IF(AH308>60,\"B\",IF(AH308>50,\"C+\",IF(AH308>40,\"C\",IF(AH308>=33,\"D\",\"E\"))))))),\"Abs\")","v":"E"},"--",null,null,null,null,null,{"$f":"Table_2[[#This Row],[Column51]]&Table_2[[#This Row],[Column52]]&AW310","v":""}]
[308,null,null,null,null,null,null,null,null,null,null,null,null,null,null,null,null,null,null,null,"--",0,null,null,{"$f":"(K309/Instructions!$C$23)*100","v":0},{"$f":"(L309/Instructions!$C$24)*100","v":0},{"$f":"(M309/Instructions!$C$25)*100","v":0},{"$f":"(N309/Instructions!$C$26)*100","v":0},{"$f":"(O309/Instructions!$C$27)*100","v":0},{"$f":"(P309/Instructions!$C$28)*100","v":0},{"$f":"(Q309/Instructions!$C$29)*100","v":0},{"$f":"(R309/Instructions!$C$30)*100","v":0},{"$f":"(S309/Instructions!$C$31)*100","v":0},{"$f":"(T309/Instructions!$C$30)*100","v":0},{"$f":"(U309/Instructions!$C$33)*100","v":{"$error":"#VALUE!"}},"----","E","E","E","E","E","E","E","E","E","E","--",null,null,null,null,null,{"$f":"Table_2[[#This Row],[Column51]]&Table_2[[#This Row],[Column52]]&AW311","v":""}]
[309,null,null,null,null,null,null,null,null,null,null,null,null,null,null,null,null,null,null,null,"--",0,null,null,{"$f":"(K310/Instructions!$C$23)*100","v":0},{"$f":"(L310/Instructions!$C$24)*100","v":0},{"$f":"(M310/Instructions!$C$25)*100","v":0},{"$f":"(N310/Instructions!$C$26)*100","v":0},{"$f":"(O310/Instructions!$C$27)*100","v":0},{"$f":"(P310/Instructions!$C$28)*100","v":0},{"$f":"(Q310/Instructions!$C$29)*100","v":0},{"$f":"(R310/Instructions!$C$30)*100","v":0},{"$f":"(S310/Instructions!$C$31)*100","v":0},{"$f":"(T310/Instructions!$C$30)*100","v":0},{"$f":"(U310/Instructions!$C$33)*100","v":{"$error":"#VALUE!"}},"----","E","E","E","E","E","E","E","E","E","E","--",null,null,null,null,null,{"$f":"Table_2[[#This Row],[Column51]]&Table_2[[#This Row],[Column52]]&AW312","v":""}]
[310,null,null,null,null,null,null,null,null,null,null,null,null,null,null,null,null,null,null,null,"--",0,null,null,{"$f":"(K311/Instructions!$C$23)*100","v":0},{"$f":"(L311/Instructions!$C$24)*100","v":0},{"$f":"(M311/Instructions!$C$25)*100","v":0},{"$f":"(N311/Instructions!$C$26)*100","v":0},{"$f":"(O311/Instructions!$C$27)*100","v":0},{"$f":"(P311/Instructions!$C$28)*100","v":0},{"$f":"(Q311/Instructions!$C$29)*100","v":0},{"$f":"(R311/Instructions!$C$30)*100","v":0},{"$f":"(S311/Instructions!$C$31)*100","v":0},{"$f":"(T311/Instructions!$C$30)*100","v":0},{"$f":"(U311/Instructions!$C$33)*100","v":{"$error":"#VALUE!"}},"----","E","E","E","E","E","E","E","E","E","E","--",null,null,null,null,null,{"$f":"Table_2[[#This Row],[Column51]]&Table_2[[#This Row],[Column52]]&AW313","v":""}]
[311,null,null,null,null,null,null,null,null,null,null,null,null,null,null,null,null,null,null,null,"--",0,null,null,{"$f":"(K312/Instructions!$C$23)*100","v":0},{"$f":"(L312/Instructions!$C$24)*100","v":0},{"$f":"(M312/Instructions!$C$25)*100","v":0},{"$f":"(N312/Instructions!$C$26)*100","v":0},{"$f":"(O312/Instructions!$C$27)*100","v":0},{"$f":"(P312/Instructions!$C$28)*100","v":0},{"$f":"(Q312/Instructions!$C$29)*100","v":0},{"$f":"(R312/Instructions!$C$30)*100","v":0},{"$f":"(S312/Instructions!$C$31)*100","v":0},{"$f":"(T312/Instructions!$C$30)*100","v":0},{"$f":"(U312/Instructions!$C$33)*100","v":{"$error":"#VALUE!"}},"----","E","E","E","E","E","E","E","E","E","E","--",null,null,null,null,null,{"$f":"Table_2[[#This Row],[Column51]]&Table_2[[#This Row],[Column52]]&AW314","v":""}]
[312,null,null,null,null,null,null,null,null,null,null,null,null,null,null,null,null,null,null,null,"--",0,null,null,{"$f":"(K313/Instructions!$C$23)*100","v":0},{"$f":"(L313/Instructions!$C$24)*100","v":0},{"$f":"(M313/Instructions!$C$25)*100","v":0},{"$f":"(N313/Instructions!$C$26)*100","v":0},{"$f":"(O313/Instructions!$C$27)*100","v":0},{"$f":"(P313/Instructions!$C$28)*100","v":0},{"$f":"(Q313/Instructions!$C$29)*100","v":0},{"$f":"(R313/Instructions!$C$30)*100","v":0},{"$f":"(S313/Instructions!$C$31)*100","v":0},{"$f":"(T313/Instructions!$C$30)*100","v":0},{"$f":"(U313/Instructions!$C$33)*100","v":{"$error":"#VALUE!"}},"----","E","E","E","E","E","E","E","E","E","E","--",null,null,null,null,null,{"$f":"Table_2[[#This Row],[Column51]]&Table_2[[#This Row],[Column52]]&AW315","v":""}]
[313,null,null,null,null,null,null,null,null,null,null,null,null,null,null,null,null,null,null,null,"--",0,null,null,{"$f":"(K314/Instructions!$C$23)*100","v":0},{"$f":"(L314/Instructions!$C$24)*100","v":0},{"$f":"(M314/Instructions!$C$25)*100","v":0},{"$f":"(N314/Instructions!$C$26)*100","v":0},{"$f":"(O314/Instructions!$C$27)*100","v":0},{"$f":"(P314/Instructions!$C$28)*100","v":0},{"$f":"(Q314/Instructions!$C$29)*100","v":0},{"$f":"(R314/Instructions!$C$30)*100","v":0},{"$f":"(S314/Instructions!$C$31)*100","v":0},{"$f":"(T314/Instructions!$C$30)*100","v":0},{"$f":"(U314/Instructions!$C$33)*100","v":{"$error":"#VALUE!"}},"----","E","E","E","E","E","E","E","E","E","E","--",null,null,null,null,null,{"$f":"Table_2[[#This Row],[Column51]]&Table_2[[#This Row],[Column52]]&AW316","v":""}]
[314,null,null,null,null,null,null,null,null,null,null,null,null,null,null,null,null,null,null,null,"--",0,null,null,{"$f":"(K315/Instructions!$C$23)*100","v":0},{"$f":"(L315/Instructions!$C$24)*100","v":0},{"$f":"(M315/Instructions!$C$25)*100","v":0},{"$f":"(N315/Instructions!$C$26)*100","v":0},{"$f":"(O315/Instructions!$C$27)*100","v":0},{"$f":"(P315/Instructions!$C$28)*100","v":0},{"$f":"(Q315/Instructions!$C$29)*100","v":0},{"$f":"(R315/Instructions!$C$30)*100","v":0},{"$f":"(S315/Instructions!$C$31)*100","v":0},{"$f":"(T315/Instructions!$C$30)*100","v":0},{"$f":"(U315/Instructions!$C$33)*100","v":{"$error":"#VALUE!"}},"----","E","E","E","E","E","E","E","E","E","E","--",null,null,null,null,null,{"$f":"Table_2[[#This Row],[Column51]]&Table_2[[#This Row],[Column52]]&AW317","v":""}]
[315,null,null,null,null,null,null,null,null,null,null,null,null,null,null,null,null,null,null,null,"--",0,null,null,{"$f":"(K316/Instructions!$C$23)*100","v":0},{"$f":"(L316/Instructions!$C$24)*100","v":0},{"$f":"(M316/Instructions!$C$25)*100","v":0},{"$f":"(N316/Instructions!$C$26)*100","v":0},{"$f":"(O316/Instructions!$C$27)*100","v":0},{"$f":"(P316/Instructions!$C$28)*100","v":0},{"$f":"(Q316/Instructions!$C$29)*100","v":0},{"$f":"(R316/Instructions!$C$30)*100","v":0},{"$f":"(S316/Instructions!$C$31)*100","v":0},{"$f":"(T316/Instructions!$C$30)*100","v":0},{"$f":"(U316/Instructions!$C$33)*100","v":{"$error":"#VALUE!"}},"----","E","E","E","E","E","E","E","E","E","E","--",null,null,null,null,null,{"$f":"Table_2[[#This Row],[Column51]]&Table_2[[#This Row],[Column52]]&AW318","v":""}]
[316,null,null,null,null,null,null,null,null,null,null,null,null,null,null,null,null,null,null,null,"--",0,null,null,{"$f":"(K317/Instructions!$C$23)*100","v":0},{"$f":"(L317/Instructions!$C$24)*100","v":0},{"$f":"(M317/Instructions!$C$25)*100","v":0},{"$f":"(N317/Instructions!$C$26)*100","v":0},{"$f":"(O317/Instructions!$C$27)*100","v":0},{"$f":"(P317/Instructions!$C$28)*100","v":0},{"$f":"(Q317/Instructions!$C$29)*100","v":0},{"$f":"(R317/Instructions!$C$30)*100","v":0},{"$f":"(S317/Instructions!$C$31)*100","v":0},{"$f":"(T317/Instructions!$C$30)*100","v":0},{"$f":"(U317/Instructions!$C$33)*100","v":{"$error":"#VALUE!"}},"----","E","E","E","E","E","E","E","E","E","E","--",null,null,null,null,null,{"$f":"Table_2[[#This Row],[Column51]]&Table_2[[#This Row],[Column52]]&AW319","v":""}]
[317,null,null,null,null,null,null,null,null,null,null,null,null,null,null,null,null,null,null,null,"--",0,null,null,{"$f":"(K318/Instructions!$C$23)*100","v":0},{"$f":"(L318/Instructions!$C$24)*100","v":0},{"$f":"(M318/Instructions!$C$25)*100","v":0},{"$f":"(N318/Instructions!$C$26)*100","v":0},{"$f":"(O318/Instructions!$C$27)*100","v":0},{"$f":"(P318/Instructions!$C$28)*100","v":0},{"$f":"(Q318/Instructions!$C$29)*100","v":0},{"$f":"(R318/Instructions!$C$30)*100","v":0},{"$f":"(S318/Instructions!$C$31)*100","v":0},{"$f":"(T318/Instructions!$C$30)*100","v":0},{"$f":"(U318/Instructions!$C$33)*100","v":{"$error":"#VALUE!"}},"----","E","E","E","E","E","E","E","E","E","E","--",null,null,null,null,null,{"$f":"Table_2[[#This Row],[Column51]]&Table_2[[#This Row],[Column52]]&AW320","v":""}]
[318,null,null,null,null,null,null,null,null,null,null,null,null,null,null,null,null,null,null,null,"--",0,null,null,{"$f":"(K319/Instructions!$C$23)*100","v":0},{"$f":"(L319/Instructions!$C$24)*100","v":0},{"$f":"(M319/Instructions!$C$25)*100","v":0},{"$f":"(N319/Instructions!$C$26)*100","v":0},{"$f":"(O319/Instructions!$C$27)*100","v":0},{"$f":"(P319/Instructions!$C$28)*100","v":0},{"$f":"(Q319/Instructions!$C$29)*100","v":0},{"$f":"(R319/Instructions!$C$30)*100","v":0},{"$f":"(S319/Instructions!$C$31)*100","v":0},{"$f":"(T319/Instructions!$C$30)*100","v":0},{"$f":"(U319/Instructions!$C$33)*100","v":{"$error":"#VALUE!"}},"----","E","E","E","E","E","E","E","E","E","E","--",null,null,null,null,null,{"$f":"Table_2[[#This Row],[Column51]]&Table_2[[#This Row],[Column52]]&AW321","v":""}]
[319,null,null,null,null,null,null,null,null,null,null,null,null,null,null,null,null,null,null,null,"--",0,null,null,{"$f":"(K320/Instructions!$C$23)*100","v":0},{"$f":"(L320/Instructions!$C$24)*100","v":0},{"$f":"(M320/Instructions!$C$25)*100","v":0},{"$f":"(N320/Instructions!$C$26)*100","v":0},{"$f":"(O320/Instructions!$C$27)*100","v":0},{"$f":"(P320/Instructions!$C$28)*100","v":0},{"$f":"(Q320/Instructions!$C$29)*100","v":0},{"$f":"(R320/Instructions!$C$30)*100","v":0},{"$f":"(S320/Instructions!$C$31)*100","v":0},{"$f":"(T320/Instructions!$C$30)*100","v":0},{"$f":"(U320/Instructions!$C$33)*100","v":{"$error":"#VALUE!"}},"----","E","E","E","E","E","E","E","E","E","E","--",null,null,null,null,null,{"$f":"Table_2[[#This Row],[Column51]]&Table_2[[#This Row],[Column52]]&AW322","v":""}]
[320,null,null,null,null,null,null,null,null,null,null,null,null,null,null,null,null,null,null,null,"--",0,null,null,{"$f":"(K321/Instructions!$C$23)*100","v":0},{"$f":"(L321/Instructions!$C$24)*100","v":0},{"$f":"(M321/Instructions!$C$25)*100","v":0},{"$f":"(N321/Instructions!$C$26)*100","v":0},{"$f":"(O321/Instructions!$C$27)*100","v":0},{"$f":"(P321/Instructions!$C$28)*100","v":0},{"$f":"(Q321/Instructions!$C$29)*100","v":0},{"$f":"(R321/Instructions!$C$30)*100","v":0},{"$f":"(S321/Instructions!$C$31)*100","v":0},{"$f":"(T321/Instructions!$C$30)*100","v":0},{"$f":"(U321/Instructions!$C$33)*100","v":{"$error":"#VALUE!"}},"----","E","E","E","E","E","E","E","E","E","E","--",null,null,null,null,null,{"$f":"Table_2[[#This Row],[Column51]]&Table_2[[#This Row],[Column52]]&AW323","v":""}]
[321,null,null,null,null,null,null,null,null,null,null,null,null,null,null,null,null,null,null,null,"--",0,null,null,{"$f":"(K322/Instructions!$C$23)*100","v":0},{"$f":"(L322/Instructions!$C$24)*100","v":0},{"$f":"(M322/Instructions!$C$25)*100","v":0},{"$f":"(N322/Instructions!$C$26)*100","v":0},{"$f":"(O322/Instructions!$C$27)*100","v":0},{"$f":"(P322/Instructions!$C$28)*100","v":0},{"$f":"(Q322/Instructions!$C$29)*100","v":0},{"$f":"(R322/Instructions!$C$30)*100","v":0},{"$f":"(S322/Instructions!$C$31)*100","v":0},{"$f":"(T322/Instructions!$C$30)*100","v":0},{"$f":"(U322/Instructions!$C$33)*100","v":{"$error":"#VALUE!"}},"----","E","E","E","E","E","E","E","E","E","E","--",null,null,null,null,null,{"$f":"Table_2[[#This Row],[Column51]]&Table_2[[#This Row],[Column52]]&AW324","v":""}]
[322,null,null,null,null,null,null,null,null,null,null,null,null,null,null,null,null,null,null,null,{"$f":"IF(MIN(Y323:AD323)>=33,SUM(K323:P323),\"--\")","v":"--"},{"$f":"IF(U323=\"--\",0,U323)","v":0},null,null,{"$f":"(K323/Instructions!$C$23)*100","v":0},{"$f":"(L323/Instructions!$C$24)*100","v":0},{"$f":"(M323/Instructions!$C$25)*100","v":0},{"$f":"(N323/Instructions!$C$26)*100","v":0},{"$f":"(O323/Instructions!$C$27)*100","v":0},{"$f":"(P323/Instructions!$C$28)*100","v":0},{"$f":"(Q323/Instructions!$C$29)*100","v":0},{"$f":"(R323/Instructions!$C$30)*100","v":0},{"$f":"(S323/Instructions!$C$31)*100","v":0},{"$f":"(T323/Instructions!$C$30)*100","v":0},{"$f":"(U323/Instructions!$C$33)*100","v":{"$error":"#VALUE!"}},"----","E","E","E","E","E","E","E","E","E","E",{"$f":"IFERROR(IF(AI323>90,\"A+\",IF(AI323>80,\"A\",IF(AI323>70,\"B+\",IF(AI323>60,\"B\",IF(AI323>50,\"C+\",IF(AI323>40,\"C\",IF(AI323>=33,\"D\",\"E\"))))))),\"--\")","v":"--"},null,null,null,null,null,{"$f":"Table_2[[#This Row],[Column51]]&Table_2[[#This Row],[Column52]]&AW325","v":""}]
[323,null,null,null,null,null,null,null,null,null,null,null,null,null,null,null,null,null,null,null,"--",0,null,null,{"$f":"(K324/Instructions!$C$23)*100","v":0},{"$f":"(L324/Instructions!$C$24)*100","v":0},{"$f":"(M324/Instructions!$C$25)*100","v":0},{"$f":"(N324/Instructions!$C$26)*100","v":0},{"$f":"(O324/Instructions!$C$27)*100","v":0},{"$f":"(P324/Instructions!$C$28)*100","v":0},{"$f":"(Q324/Instructions!$C$29)*100","v":0},{"$f":"(R324/Instructions!$C$30)*100","v":0},{"$f":"(S324/Instructions!$C$31)*100","v":0},{"$f":"(T324/Instructions!$C$30)*100","v":0},{"$f":"(U324/Instructions!$C$33)*100","v":{"$error":"#VALUE!"}},"----","E","E","E","E","E","E","E","E","E","E","--",null,null,null,null,null,{"$f":"Table_2[[#This Row],[Column51]]&Table_2[[#This Row],[Column52]]&AW326","v":""}]
[324,null,null,null,null,null,null,null,null,null,null,null,null,null,null,null,null,null,null,null,"--",0,null,null,{"$f":"(K325/Instructions!$C$23)*100","v":0},{"$f":"(L325/Instructions!$C$24)*100","v":0},{"$f":"(M325/Instructions!$C$25)*100","v":0},{"$f":"(N325/Instructions!$C$26)*100","v":0},{"$f":"(O325/Instructions!$C$27)*100","v":0},{"$f":"(P325/Instructions!$C$28)*100","v":0},{"$f":"(Q325/Instructions!$C$29)*100","v":0},{"$f":"(R325/Instructions!$C$30)*100","v":0},{"$f":"(S325/Instructions!$C$31)*100","v":0},{"$f":"(T325/Instructions!$C$30)*100","v":0},{"$f":"(U325/Instructions!$C$33)*100","v":{"$error":"#VALUE!"}},"----","E","E","E","E","E","E","E","E","E","E","--",null,null,null,null,null,{"$f":"Table_2[[#This Row],[Column51]]&Table_2[[#This Row],[Column52]]&AW327","v":""}]
[325,null,null,null,null,null,null,null,null,null,null,null,null,null,null,null,null,null,null,null,"--",0,null,null,{"$f":"(K326/Instructions!$C$23)*100","v":0},{"$f":"(L326/Instructions!$C$24)*100","v":0},{"$f":"(M326/Instructions!$C$25)*100","v":0},{"$f":"(N326/Instructions!$C$26)*100","v":0},{"$f":"(O326/Instructions!$C$27)*100","v":0},{"$f":"(P326/Instructions!$C$28)*100","v":0},{"$f":"(Q326/Instructions!$C$29)*100","v":0},{"$f":"(R326/Instructions!$C$30)*100","v":0},{"$f":"(S326/Instructions!$C$31)*100","v":0},{"$f":"(T326/Instructions!$C$30)*100","v":0},{"$f":"(U326/Instructions!$C$33)*100","v":{"$error":"#VALUE!"}},"----","E","E","E","E","E","E","E","E","E","E","--",null,null,null,null,null,{"$f":"Table_2[[#This Row],[Column51]]&Table_2[[#This Row],[Column52]]&AW328","v":""}]
[326,null,null,null,null,null,null,null,null,null,null,null,null,null,null,null,null,null,null,null,"--",0,null,null,{"$f":"(K327/Instructions!$C$23)*100","v":0},{"$f":"(L327/Instructions!$C$24)*100","v":0},{"$f":"(M327/Instructions!$C$25)*100","v":0},{"$f":"(N327/Instructions!$C$26)*100","v":0},{"$f":"(O327/Instructions!$C$27)*100","v":0},{"$f":"(P327/Instructions!$C$28)*100","v":0},{"$f":"(Q327/Instructions!$C$29)*100","v":0},{"$f":"(R327/Instructions!$C$30)*100","v":0},{"$f":"(S327/Instructions!$C$31)*100","v":0},{"$f":"(T327/Instructions!$C$30)*100","v":0},{"$f":"(U327/Instructions!$C$33)*100","v":{"$error":"#VALUE!"}},"----","E","E","E","E","E","E","E","E","E","E","--",null,null,null,null,null,{"$f":"Table_2[[#This Row],[Column51]]&Table_2[[#This Row],[Column52]]&AW329","v":""}]
[327,null,null,null,null,null,null,null,null,null,null,null,null,null,null,null,null,null,null,null,"--",0,null,null,{"$f":"(K328/Instructions!$C$23)*100","v":0},{"$f":"(L328/Instructions!$C$24)*100","v":0},{"$f":"(M328/Instructions!$C$25)*100","v":0},{"$f":"(N328/Instructions!$C$26)*100","v":0},{"$f":"(O328/Instructions!$C$27)*100","v":0},{"$f":"(P328/Instructions!$C$28)*100","v":0},{"$f":"(Q328/Instructions!$C$29)*100","v":0},{"$f":"(R328/Instructions!$C$30)*100","v":0},{"$f":"(S328/Instructions!$C$31)*100","v":0},{"$f":"(T328/Instructions!$C$30)*100","v":0},{"$f":"(U328/Instructions!$C$33)*100","v":{"$error":"#VALUE!"}},"----","E","E","E","E","E","E","E","E","E","E","--",null,null,null,null,null,{"$f":"Table_2[[#This Row],[Column51]]&Table_2[[#This Row],[Column52]]&AW330","v":""}]
[328,null,null,null,null,null,null,null,null,null,null,null,null,null,null,null,null,null,null,null,"--",0,null,null,{"$f":"(K329/Instructions!$C$23)*100","v":0},{"$f":"(L329/Instructions!$C$24)*100","v":0},{"$f":"(M329/Instructions!$C$25)*100","v":0},{"$f":"(N329/Instructions!$C$26)*100","v":0},{"$f":"(O329/Instructions!$C$27)*100","v":0},{"$f":"(P329/Instructions!$C$28)*100","v":0},{"$f":"(Q329/Instructions!$C$29)*100","v":0},{"$f":"(R329/Instructions!$C$30)*100","v":0},{"$f":"(S329/Instructions!$C$31)*100","v":0},{"$f":"(T329/Instructions!$C$30)*100","v":0},{"$f":"(U329/Instructions!$C$33)*100","v":{"$error":"#VALUE!"}},"----","E","E","E","E","E","E","E","E","E","E","--",null,null,null,null,null,{"$f":"Table_2[[#This Row],[Column51]]&Table_2[[#This Row],[Column52]]&AW331","v":""}]
[329,null,null,null,null,null,null,null,null,null,null,null,null,null,null,null,null,null,null,null,"--",0,null,null,{"$f":"(K330/Instructions!$C$23)*100","v":0},{"$f":"(L330/Instructions!$C$24)*100","v":0},{"$f":"(M330/Instructions!$C$25)*100","v":0},{"$f":"(N330/Instructions!$C$26)*100","v":0},{"$f":"(O330/Instructions!$C$27)*100","v":0},{"$f":"(P330/Instructions!$C$28)*100","v":0},{"$f":"(Q330/Instructions!$C$29)*100","v":0},{"$f":"(R330/Instructions!$C$30)*100","v":0},{"$f":"(S330/Instructions!$C$31)*100","v":0},{"$f":"(T330/Instructions!$C$30)*100","v":0},{"$f":"(U330/Instructions!$C$33)*100","v":{"$error":"#VALUE!"}},"----","E","E","E","E","E","E","E","E","E","E","--",null,null,null,null,null,{"$f":"Table_2[[#This Row],[Column51]]&Table_2[[#This Row],[Column52]]&AW332","v":""}]
[330,null,null,null,null,null,null,null,null,null,null,null,null,null,null,null,null,null,null,null,"--",0,null,null,{"$f":"(K331/Instructions!$C$23)*100","v":0},{"$f":"(L331/Instructions!$C$24)*100","v":0},{"$f":"(M331/Instructions!$C$25)*100","v":0},{"$f":"(N331/Instructions!$C$26)*100","v":0},{"$f":"(O331/Instructions!$C$27)*100","v":0},{"$f":"(P331/Instructions!$C$28)*100","v":0},{"$f":"(Q331/Instructions!$C$29)*100","v":0},{"$f":"(R331/Instructions!$C$30)*100","v":0},{"$f":"(S331/Instructions!$C$31)*100","v":0},{"$f":"(T331/Instructions!$C$30)*100","v":0},{"$f":"(U331/Instructions!$C$33)*100","v":{"$error":"#VALUE!"}},"----","E","E","E","E","E","E","E","E","E","E","--",null,null,null,null,null,{"$f":"Table_2[[#This Row],[Column51]]&Table_2[[#This Row],[Column52]]&AW333","v":""}]
[331,null,null,null,null,null,null,null,null,null,null,null,null,null,null,null,null,null,null,null,"--",0,null,null,{"$f":"(K332/Instructions!$C$23)*100","v":0},{"$f":"(L332/Instructions!$C$24)*100","v":0},{"$f":"(M332/Instructions!$C$25)*100","v":0},{"$f":"(N332/Instructions!$C$26)*100","v":0},{"$f":"(O332/Instructions!$C$27)*100","v":0},{"$f":"(P332/Instructions!$C$28)*100","v":0},{"$f":"(Q332/Instructions!$C$29)*100","v":0},{"$f":"(R332/Instructions!$C$30)*100","v":0},{"$f":"(S332/Instructions!$C$31)*100","v":0},{"$f":"(T332/Instructions!$C$30)*100","v":0},{"$f":"(U332/Instructions!$C$33)*100","v":{"$error":"#VALUE!"}},"----","E","E","E","E","E","E","E","E","E","E","--",null,null,null,null,null,{"$f":"Table_2[[#This Row],[Column51]]&Table_2[[#This Row],[Column52]]&AW334","v":""}]
[332,null,null,null,null,null,null,null,null,null,null,null,null,null,null,null,null,null,null,null,"--",0,null,null,{"$f":"(K333/Instructions!$C$23)*100","v":0},{"$f":"(L333/Instructions!$C$24)*100","v":0},{"$f":"(M333/Instructions!$C$25)*100","v":0},{"$f":"(N333/Instructions!$C$26)*100","v":0},{"$f":"(O333/Instructions!$C$27)*100","v":0},{"$f":"(P333/Instructions!$C$28)*100","v":0},{"$f":"(Q333/Instructions!$C$29)*100","v":0},{"$f":"(R333/Instructions!$C$30)*100","v":0},{"$f":"(S333/Instructions!$C$31)*100","v":0},{"$f":"(T333/Instructions!$C$30)*100","v":0},{"$f":"(U333/Instructions!$C$33)*100","v":{"$error":"#VALUE!"}},"----","E","E","E","E","E","E","E","E","E","E","--",null,null,null,null,null,{"$f":"Table_2[[#This Row],[Column51]]&Table_2[[#This Row],[Column52]]&AW335","v":""}]
[333,null,null,null,null,null,null,null,null,null,null,null,null,null,null,null,null,null,null,null,"--",0,null,null,{"$f":"(K334/Instructions!$C$23)*100","v":0},{"$f":"(L334/Instructions!$C$24)*100","v":0},{"$f":"(M334/Instructions!$C$25)*100","v":0},{"$f":"(N334/Instructions!$C$26)*100","v":0},{"$f":"(O334/Instructions!$C$27)*100","v":0},{"$f":"(P334/Instructions!$C$28)*100","v":0},{"$f":"(Q334/Instructions!$C$29)*100","v":0},{"$f":"(R334/Instructions!$C$30)*100","v":0},{"$f":"(S334/Instructions!$C$31)*100","v":0},{"$f":"(T334/Instructions!$C$30)*100","v":0},{"$f":"(U334/Instructions!$C$33)*100","v":{"$error":"#VALUE!"}},"----","E","E","E","E","E","E","E","E","E","E","--",null,null,null,null,null,{"$f":"Table_2[[#This Row],[Column51]]&Table_2[[#This Row],[Column52]]&AW336","v":""}]
[334,null,null,null,null,null,null,null,null,null,null,null,null,null,null,null,null,null,null,null,"--",0,null,null,{"$f":"(K335/Instructions!$C$23)*100","v":0},{"$f":"(L335/Instructions!$C$24)*100","v":0},{"$f":"(M335/Instructions!$C$25)*100","v":0},{"$f":"(N335/Instructions!$C$26)*100","v":0},{"$f":"(O335/Instructions!$C$27)*100","v":0},{"$f":"(P335/Instructions!$C$28)*100","v":0},{"$f":"(Q335/Instructions!$C$29)*100","v":0},{"$f":"(R335/Instructions!$C$30)*100","v":0},{"$f":"(S335/Instructions!$C$31)*100","v":0},{"$f":"(T335/Instructions!$C$30)*100","v":0},{"$f":"(U335/Instructions!$C$33)*100","v":{"$error":"#VALUE!"}},"----","E","E","E","E","E","E","E","E","E","E","--",null,null,null,null,null,{"$f":"Table_2[[#This Row],[Column51]]&Table_2[[#This Row],[Column52]]&AW337","v":""}]
[335,null,null,null,null,null,null,null,null,null,null,null,null,null,null,null,null,null,null,null,"--",0,null,null,{"$f":"(K336/Instructions!$C$23)*100","v":0},{"$f":"(L336/Instructions!$C$24)*100","v":0},{"$f":"(M336/Instructions!$C$25)*100","v":0},{"$f":"(N336/Instructions!$C$26)*100","v":0},{"$f":"(O336/Instructions!$C$27)*100","v":0},{"$f":"(P336/Instructions!$C$28)*100","v":0},{"$f":"(Q336/Instructions!$C$29)*100","v":0},{"$f":"(R336/Instructions!$C$30)*100","v":0},{"$f":"(S336/Instructions!$C$31)*100","v":0},{"$f":"(T336/Instructions!$C$30)*100","v":0},{"$f":"(U336/Instructions!$C$33)*100","v":{"$error":"#VALUE!"}},"----","E","E","E","E","E","E","E","E","E","E","--",null,null,null,null,null,{"$f":"Table_2[[#This Row],[Column51]]&Table_2[[#This Row],[Column52]]&AW338","v":""}]
[336,null,null,null,null,null,null,null,null,null,null,null,null,null,null,null,null,null,null,null,"--",0,null,null,{"$f":"(K337/Instructions!$C$23)*100","v":0},{"$f":"(L337/Instructions!$C$24)*100","v":0},{"$f":"(M337/Instructions!$C$25)*100","v":0},{"$f":"(N337/Instructions!$C$26)*100","v":0},{"$f":"(O337/Instructions!$C$27)*100","v":0},{"$f":"(P337/Instructions!$C$28)*100","v":0},{"$f":"(Q337/Instructions!$C$29)*100","v":0},{"$f":"(R337/Instructions!$C$30)*100","v":0},{"$f":"(S337/Instructions!$C$31)*100","v":0},{"$f":"(T337/Instructions!$C$30)*100","v":0},{"$f":"(U337/Instructions!$C$33)*100","v":{"$error":"#VALUE!"}},"----","E","E","E","E","E","E","E","E","E","E","--",null,null,null,null,null,{"$f":"Table_2[[#This Row],[Column51]]&Table_2[[#This Row],[Column52]]&AW339","v":""}]
[337,null,null,null,null,null,null,null,null,null,null,null,null,null,null,null,null,null,null,null,"--",0,null,null,{"$f":"(K338/Instructions!$C$23)*100","v":0},{"$f":"(L338/Instructions!$C$24)*100","v":0},{"$f":"(M338/Instructions!$C$25)*100","v":0},{"$f":"(N338/Instructions!$C$26)*100","v":0},{"$f":"(O338/Instructions!$C$27)*100","v":0},{"$f":"(P338/Instructions!$C$28)*100","v":0},{"$f":"(Q338/Instructions!$C$29)*100","v":0},{"$f":"(R338/Instructions!$C$30)*100","v":0},{"$f":"(S338/Instructions!$C$31)*100","v":0},{"$f":"(T338/Instructions!$C$30)*100","v":0},{"$f":"(U338/Instructions!$C$33)*100","v":{"$error":"#VALUE!"}},"----","E","E","E","E","E","E","E","E","E","E","--",null,null,null,null,null,{"$f":"Table_2[[#This Row],[Column51]]&Table_2[[#This Row],[Column52]]&AW340","v":""}]
[338,null,null,null,null,null,null,null,null,null,null,null,null,null,null,null,null,null,null,null,"--",0,null,null,{"$f":"(K339/Instructions!$C$23)*100","v":0},{"$f":"(L339/Instructions!$C$24)*100","v":0},{"$f":"(M339/Instructions!$C$25)*100","v":0},{"$f":"(N339/Instructions!$C$26)*100","v":0},{"$f":"(O339/Instructions!$C$27)*100","v":0},{"$f":"(P339/Instructions!$C$28)*100","v":0},{"$f":"(Q339/Instructions!$C$29)*100","v":0},{"$f":"(R339/Instructions!$C$30)*100","v":0},{"$f":"(S339/Instructions!$C$31)*100","v":0},{"$f":"(T339/Instructions!$C$30)*100","v":0},{"$f":"(U339/Instructions!$C$33)*100","v":{"$error":"#VALUE!"}},"----","E","E","E","E","E","E","E","E","E","E","--",null,null,null,null,null,{"$f":"Table_2[[#This Row],[Column51]]&Table_2[[#This Row],[Column52]]&AW341","v":""}]
[339,null,null,null,null,null,null,null,null,null,null,null,null,null,null,null,null,null,null,null,"--",0,null,null,{"$f":"(K340/Instructions!$C$23)*100","v":0},{"$f":"(L340/Instructions!$C$24)*100","v":0},{"$f":"(M340/Instructions!$C$25)*100","v":0},{"$f":"(N340/Instructions!$C$26)*100","v":0},{"$f":"(O340/Instructions!$C$27)*100","v":0},{"$f":"(P340/Instructions!$C$28)*100","v":0},{"$f":"(Q340/Instructions!$C$29)*100","v":0},{"$f":"(R340/Instructions!$C$30)*100","v":0},{"$f":"(S340/Instructions!$C$31)*100","v":0},{"$f":"(T340/Instructions!$C$30)*100","v":0},{"$f":"(U340/Instructions!$C$33)*100","v":{"$error":"#VALUE!"}},"----","E","E","E","E","E","E","E","E","E","E","--",null,null,null,null,null,{"$f":"Table_2[[#This Row],[Column51]]&Table_2[[#This Row],[Column52]]&AW342","v":""}]
[340,null,null,null,null,null,null,null,null,null,null,null,null,null,null,null,null,null,null,null,"--",0,null,null,{"$f":"(K341/Instructions!$C$23)*100","v":0},{"$f":"(L341/Instructions!$C$24)*100","v":0},{"$f":"(M341/Instructions!$C$25)*100","v":0},{"$f":"(N341/Instructions!$C$26)*100","v":0},{"$f":"(O341/Instructions!$C$27)*100","v":0},{"$f":"(P341/Instructions!$C$28)*100","v":0},{"$f":"(Q341/Instructions!$C$29)*100","v":0},{"$f":"(R341/Instructions!$C$30)*100","v":0},{"$f":"(S341/Instructions!$C$31)*100","v":0},{"$f":"(T341/Instructions!$C$30)*100","v":0},{"$f":"(U341/Instructions!$C$33)*100","v":{"$error":"#VALUE!"}},"----","E","E","E","E","E","E","E","E","E","E","--",null,null,null,null,null,{"$f":"Table_2[[#This Row],[Column51]]&Table_2[[#This Row],[Column52]]&AW343","v":""}]
[341,null,null,null,null,null,null,null,null,null,null,null,null,null,null,null,null,null,null,null,"--",0,null,null,{"$f":"(K342/Instructions!$C$23)*100","v":0},{"$f":"(L342/Instructions!$C$24)*100","v":0},{"$f":"(M342/Instructions!$C$25)*100","v":0},{"$f":"(N342/Instructions!$C$26)*100","v":0},{"$f":"(O342/Instructions!$C$27)*100","v":0},{"$f":"(P342/Instructions!$C$28)*100","v":0},{"$f":"(Q342/Instructions!$C$29)*100","v":0},{"$f":"(R342/Instructions!$C$30)*100","v":0},{"$f":"(S342/Instructions!$C$31)*100","v":0},{"$f":"(T342/Instructions!$C$30)*100","v":0},{"$f":"(U342/Instructions!$C$33)*100","v":{"$error":"#VALUE!"}},"----","E","E","E","E","E","E","E","E","E","E","--",null,null,null,null,null,{"$f":"Table_2[[#This Row],[Column51]]&Table_2[[#This Row],[Column52]]&AW344","v":""}]
[342,null,null,null,null,null,null,null,null,null,null,null,null,null,null,null,null,null,null,null,"--",0,null,null,{"$f":"(K343/Instructions!$C$23)*100","v":0},{"$f":"(L343/Instructions!$C$24)*100","v":0},{"$f":"(M343/Instructions!$C$25)*100","v":0},{"$f":"(N343/Instructions!$C$26)*100","v":0},{"$f":"(O343/Instructions!$C$27)*100","v":0},{"$f":"(P343/Instructions!$C$28)*100","v":0},{"$f":"(Q343/Instructions!$C$29)*100","v":0},{"$f":"(R343/Instructions!$C$30)*100","v":0},{"$f":"(S343/Instructions!$C$31)*100","v":0},{"$f":"(T343/Instructions!$C$30)*100","v":0},{"$f":"(U343/Instructions!$C$33)*100","v":{"$error":"#VALUE!"}},"----","E","E","E","E","E","E","E","E","E","E","--",null,null,null,null,null,{"$f":"Table_2[[#This Row],[Column51]]&Table_2[[#This Row],[Column52]]&AW345","v":""}]
[343,null,null,null,null,null,null,null,null,null,null,null,null,null,null,null,null,null,null,null,"--",0,null,null,{"$f":"(K344/Instructions!$C$23)*100","v":0},{"$f":"(L344/Instructions!$C$24)*100","v":0},{"$f":"(M344/Instructions!$C$25)*100","v":0},{"$f":"(N344/Instructions!$C$26)*100","v":0},{"$f":"(O344/Instructions!$C$27)*100","v":0},{"$f":"(P344/Instructions!$C$28)*100","v":0},{"$f":"(Q344/Instructions!$C$29)*100","v":0},{"$f":"(R344/Instructions!$C$30)*100","v":0},{"$f":"(S344/Instructions!$C$31)*100","v":0},{"$f":"(T344/Instructions!$C$30)*100","v":0},{"$f":"(U344/Instructions!$C$33)*100","v":{"$error":"#VALUE!"}},"----","E","E","E","E","E","E","E","E","E","E","--",null,null,null,null,null,{"$f":"Table_2[[#This Row],[Column51]]&Table_2[[#This Row],[Column52]]&AW346","v":""}]
[344,null,null,null,null,null,null,null,null,null,null,null,null,null,null,null,null,null,null,null,"--",0,null,null,{"$f":"(K345/Instructions!$C$23)*100","v":0},{"$f":"(L345/Instructions!$C$24)*100","v":0},{"$f":"(M345/Instructions!$C$25)*100","v":0},{"$f":"(N345/Instructions!$C$26)*100","v":0},{"$f":"(O345/Instructions!$C$27)*100","v":0},{"$f":"(P345/Instructions!$C$28)*100","v":0},{"$f":"(Q345/Instructions!$C$29)*100","v":0},{"$f":"(R345/Instructions!$C$30)*100","v":0},{"$f":"(S345/Instructions!$C$31)*100","v":0},{"$f":"(T345/Instructions!$C$30)*100","v":0},{"$f":"(U345/Instructions!$C$33)*100","v":{"$error":"#VALUE!"}},"----","E","E","E","E","E","E","E","E","E","E","--",null,null,null,null,null,{"$f":"Table_2[[#This Row],[Column51]]&Table_2[[#This Row],[Column52]]&AW347","v":""}]
[345,null,null,null,null,null,null,null,null,null,null,null,null,null,null,null,null,null,null,null,"--",0,null,null,{"$f":"(K346/Instructions!$C$23)*100","v":0},{"$f":"(L346/Instructions!$C$24)*100","v":0},{"$f":"(M346/Instructions!$C$25)*100","v":0},{"$f":"(N346/Instructions!$C$26)*100","v":0},{"$f":"(O346/Instructions!$C$27)*100","v":0},{"$f":"(P346/Instructions!$C$28)*100","v":0},{"$f":"(Q346/Instructions!$C$29)*100","v":0},{"$f":"(R346/Instructions!$C$30)*100","v":0},{"$f":"(S346/Instructions!$C$31)*100","v":0},{"$f":"(T346/Instructions!$C$30)*100","v":0},{"$f":"(U346/Instructions!$C$33)*100","v":{"$error":"#VALUE!"}},"----","E","E","E","E","E","E","E","E","E","E","--",null,null,null,null,null,{"$f":"Table_2[[#This Row],[Column51]]&Table_2[[#This Row],[Column52]]&AW348","v":""}]
[346,null,null,null,null,null,null,null,null,null,null,null,null,null,null,null,null,null,null,null,"--",0,null,null,{"$f":"(K347/Instructions!$C$23)*100","v":0},{"$f":"(L347/Instructions!$C$24)*100","v":0},{"$f":"(M347/Instructions!$C$25)*100","v":0},{"$f":"(N347/Instructions!$C$26)*100","v":0},{"$f":"(O347/Instructions!$C$27)*100","v":0},{"$f":"(P347/Instructions!$C$28)*100","v":0},{"$f":"(Q347/Instructions!$C$29)*100","v":0},{"$f":"(R347/Instructions!$C$30)*100","v":0},{"$f":"(S347/Instructions!$C$31)*100","v":0},{"$f":"(T347/Instructions!$C$30)*100","v":0},{"$f":"(U347/Instructions!$C$33)*100","v":{"$error":"#VALUE!"}},"----","E","E","E","E","E","E","E","E","E","E","--",null,null,null,null,null,{"$f":"Table_2[[#This Row],[Column51]]&Table_2[[#This Row],[Column52]]&AW349","v":""}]
[347,null,null,null,null,null,null,null,null,null,null,null,null,null,null,null,null,null,null,null,"--",0,null,null,{"$f":"(K348/Instructions!$C$23)*100","v":0},{"$f":"(L348/Instructions!$C$24)*100","v":0},{"$f":"(M348/Instructions!$C$25)*100","v":0},{"$f":"(N348/Instructions!$C$26)*100","v":0},{"$f":"(O348/Instructions!$C$27)*100","v":0},{"$f":"(P348/Instructions!$C$28)*100","v":0},{"$f":"(Q348/Instructions!$C$29)*100","v":0},{"$f":"(R348/Instructions!$C$30)*100","v":0},{"$f":"(S348/Instructions!$C$31)*100","v":0},{"$f":"(T348/Instructions!$C$30)*100","v":0},{"$f":"(U348/Instructions!$C$33)*100","v":{"$error":"#VALUE!"}},"----","E","E","E","E","E","E","E","E","E","E","--",null,null,null,null,null,{"$f":"Table_2[[#This Row],[Column51]]&Table_2[[#This Row],[Column52]]&AW350","v":""}]
[348,null,null,null,null,null,null,null,null,null,null,null,null,null,null,null,null,null,null,null,"--",0,null,null,{"$f":"(K349/Instructions!$C$23)*100","v":0},{"$f":"(L349/Instructions!$C$24)*100","v":0},{"$f":"(M349/Instructions!$C$25)*100","v":0},{"$f":"(N349/Instructions!$C$26)*100","v":0},{"$f":"(O349/Instructions!$C$27)*100","v":0},{"$f":"(P349/Instructions!$C$28)*100","v":0},{"$f":"(Q349/Instructions!$C$29)*100","v":0},{"$f":"(R349/Instructions!$C$30)*100","v":0},{"$f":"(S349/Instructions!$C$31)*100","v":0},{"$f":"(T349/Instructions!$C$30)*100","v":0},{"$f":"(U349/Instructions!$C$33)*100","v":{"$error":"#VALUE!"}},"----","E","E","E","E","E","E","E","E","E","E","--",null,null,null,null,null,{"$f":"Table_2[[#This Row],[Column51]]&Table_2[[#This Row],[Column52]]&AW351","v":""}]
[349,null,null,null,null,null,null,null,null,null,null,null,null,null,null,null,null,null,null,null,"--",0,null,null,{"$f":"(K350/Instructions!$C$23)*100","v":0},{"$f":"(L350/Instructions!$C$24)*100","v":0},{"$f":"(M350/Instructions!$C$25)*100","v":0},{"$f":"(N350/Instructions!$C$26)*100","v":0},{"$f":"(O350/Instructions!$C$27)*100","v":0},{"$f":"(P350/Instructions!$C$28)*100","v":0},{"$f":"(Q350/Instructions!$C$29)*100","v":0},{"$f":"(R350/Instructions!$C$30)*100","v":0},{"$f":"(S350/Instructions!$C$31)*100","v":0},{"$f":"(T350/Instructions!$C$30)*100","v":0},{"$f":"(U350/Instructions!$C$33)*100","v":{"$error":"#VALUE!"}},"----","E","E","E","E","E","E","E","E","E","E","--",null,null,null,null,null,{"$f":"Table_2[[#This Row],[Column51]]&Table_2[[#This Row],[Column52]]&AW352","v":""}]
[350,null,null,null,null,null,null,null,null,null,null,null,null,null,null,null,null,null,null,null,"--",0,null,null,{"$f":"(K351/Instructions!$C$23)*100","v":0},{"$f":"(L351/Instructions!$C$24)*100","v":0},{"$f":"(M351/Instructions!$C$25)*100","v":0},{"$f":"(N351/Instructions!$C$26)*100","v":0},{"$f":"(O351/Instructions!$C$27)*100","v":0},{"$f":"(P351/Instructions!$C$28)*100","v":0},{"$f":"(Q351/Instructions!$C$29)*100","v":0},{"$f":"(R351/Instructions!$C$30)*100","v":0},{"$f":"(S351/Instructions!$C$31)*100","v":0},{"$f":"(T351/Instructions!$C$30)*100","v":0},{"$f":"(U351/Instructions!$C$33)*100","v":{"$error":"#VALUE!"}},"----","E","E","E","E","E","E","E","E","E","E","--",null,null,null,null,null,{"$f":"Table_2[[#This Row],[Column51]]&Table_2[[#This Row],[Column52]]&AW353","v":""}]
[351,null,null,null,null,null,null,null,null,null,null,null,null,null,null,null,null,null,null,null,"--",0,null,null,{"$f":"(K352/Instructions!$C$23)*100","v":0},{"$f":"(L352/Instructions!$C$24)*100","v":0},{"$f":"(M352/Instructions!$C$25)*100","v":0},{"$f":"(N352/Instructions!$C$26)*100","v":0},{"$f":"(O352/Instructions!$C$27)*100","v":0},{"$f":"(P352/Instructions!$C$28)*100","v":0},{"$f":"(Q352/Instructions!$C$29)*100","v":0},{"$f":"(R352/Instructions!$C$30)*100","v":0},{"$f":"(S352/Instructions!$C$31)*100","v":0},{"$f":"(T352/Instructions!$C$30)*100","v":0},{"$f":"(U352/Instructions!$C$33)*100","v":{"$error":"#VALUE!"}},"----","E","E","E","E","E","E","E","E","E","E","--",null,null,null,null,null,{"$f":"Table_2[[#This Row],[Column51]]&Table_2[[#This Row],[Column52]]&AW354","v":""}]
[352,null,null,null,null,null,null,null,null,null,null,null,null,null,null,null,null,null,null,null,"--",0,null,null,{"$f":"(K353/Instructions!$C$23)*100","v":0},{"$f":"(L353/Instructions!$C$24)*100","v":0},{"$f":"(M353/Instructions!$C$25)*100","v":0},{"$f":"(N353/Instructions!$C$26)*100","v":0},{"$f":"(O353/Instructions!$C$27)*100","v":0},{"$f":"(P353/Instructions!$C$28)*100","v":0},{"$f":"(Q353/Instructions!$C$29)*100","v":0},{"$f":"(R353/Instructions!$C$30)*100","v":0},{"$f":"(S353/Instructions!$C$31)*100","v":0},{"$f":"(T353/Instructions!$C$30)*100","v":0},{"$f":"(U353/Instructions!$C$33)*100","v":{"$error":"#VALUE!"}},"----","E","E","E","E","E","E","E","E","E","E","--",null,null,null,null,null,{"$f":"Table_2[[#This Row],[Column51]]&Table_2[[#This Row],[Column52]]&AW355","v":""}]
[353,null,null,null,null,null,null,null,null,null,null,null,null,null,null,null,null,null,null,null,"--",0,null,null,{"$f":"(K354/Instructions!$C$23)*100","v":0},{"$f":"(L354/Instructions!$C$24)*100","v":0},{"$f":"(M354/Instructions!$C$25)*100","v":0},{"$f":"(N354/Instructions!$C$26)*100","v":0},{"$f":"(O354/Instructions!$C$27)*100","v":0},{"$f":"(P354/Instructions!$C$28)*100","v":0},{"$f":"(Q354/Instructions!$C$29)*100","v":0},{"$f":"(R354/Instructions!$C$30)*100","v":0},{"$f":"(S354/Instructions!$C$31)*100","v":0},{"$f":"(T354/Instructions!$C$30)*100","v":0},{"$f":"(U354/Instructions!$C$33)*100","v":{"$error":"#VALUE!"}},"----","E","E","E","E","E","E","E","E","E","E","--",null,null,null,null,null,{"$f":"Table_2[[#This Row],[Column51]]&Table_2[[#This Row],[Column52]]&AW356","v":""}]
[354,null,null,null,null,null,null,null,null,null,null,null,null,null,null,null,null,null,null,null,"--",0,null,null,{"$f":"(K355/Instructions!$C$23)*100","v":0},{"$f":"(L355/Instructions!$C$24)*100","v":0},{"$f":"(M355/Instructions!$C$25)*100","v":0},{"$f":"(N355/Instructions!$C$26)*100","v":0},{"$f":"(O355/Instructions!$C$27)*100","v":0},{"$f":"(P355/Instructions!$C$28)*100","v":0},{"$f":"(Q355/Instructions!$C$29)*100","v":0},{"$f":"(R355/Instructions!$C$30)*100","v":0},{"$f":"(S355/Instructions!$C$31)*100","v":0},{"$f":"(T355/Instructions!$C$30)*100","v":0},{"$f":"(U355/Instructions!$C$33)*100","v":{"$error":"#VALUE!"}},"----","E","E","E","E","E","E","E","E","E","E","--",null,null,null,null,null,{"$f":"Table_2[[#This Row],[Column51]]&Table_2[[#This Row],[Column52]]&AW357","v":""}]
[355,null,null,null,null,null,null,null,null,null,null,null,null,null,null,null,null,null,null,null,"--",0,null,null,{"$f":"(K356/Instructions!$C$23)*100","v":0},{"$f":"(L356/Instructions!$C$24)*100","v":0},{"$f":"(M356/Instructions!$C$25)*100","v":0},{"$f":"(N356/Instructions!$C$26)*100","v":0},{"$f":"(O356/Instructions!$C$27)*100","v":0},{"$f":"(P356/Instructions!$C$28)*100","v":0},{"$f":"(Q356/Instructions!$C$29)*100","v":0},{"$f":"(R356/Instructions!$C$30)*100","v":0},{"$f":"(S356/Instructions!$C$31)*100","v":0},{"$f":"(T356/Instructions!$C$30)*100","v":0},{"$f":"(U356/Instructions!$C$33)*100","v":{"$error":"#VALUE!"}},"----","E","E","E","E","E","E","E","E","E","E","--",null,null,null,null,null,{"$f":"Table_2[[#This Row],[Column51]]&Table_2[[#This Row],[Column52]]&AW358","v":""}]
[356,null,null,null,null,null,null,null,null,null,null,null,null,null,null,null,null,null,null,null,"--",0,null,null,{"$f":"(K357/Instructions!$C$23)*100","v":0},{"$f":"(L357/Instructions!$C$24)*100","v":0},{"$f":"(M357/Instructions!$C$25)*100","v":0},{"$f":"(N357/Instructions!$C$26)*100","v":0},{"$f":"(O357/Instructions!$C$27)*100","v":0},{"$f":"(P357/Instructions!$C$28)*100","v":0},{"$f":"(Q357/Instructions!$C$29)*100","v":0},{"$f":"(R357/Instructions!$C$30)*100","v":0},{"$f":"(S357/Instructions!$C$31)*100","v":0},{"$f":"(T357/Instructions!$C$30)*100","v":0},{"$f":"(U357/Instructions!$C$33)*100","v":{"$error":"#VALUE!"}},"----","E","E","E","E","E","E","E","E","E","E","--",null,null,null,null,null,{"$f":"Table_2[[#This Row],[Column51]]&Table_2[[#This Row],[Column52]]&AW359","v":""}]
[357,null,null,null,null,null,null,null,null,null,null,null,null,null,null,null,null,null,null,null,"--",0,null,null,{"$f":"(K358/Instructions!$C$23)*100","v":0},{"$f":"(L358/Instructions!$C$24)*100","v":0},{"$f":"(M358/Instructions!$C$25)*100","v":0},{"$f":"(N358/Instructions!$C$26)*100","v":0},{"$f":"(O358/Instructions!$C$27)*100","v":0},{"$f":"(P358/Instructions!$C$28)*100","v":0},{"$f":"(Q358/Instructions!$C$29)*100","v":0},{"$f":"(R358/Instructions!$C$30)*100","v":0},{"$f":"(S358/Instructions!$C$31)*100","v":0},{"$f":"(T358/Instructions!$C$30)*100","v":0},{"$f":"(U358/Instructions!$C$33)*100","v":{"$error":"#VALUE!"}},"----","E","E","E","E","E","E","E","E","E","E","--",null,null,null,null,null,{"$f":"Table_2[[#This Row],[Column51]]&Table_2[[#This Row],[Column52]]&AW360","v":""}]
[358,null,null,null,null,null,null,null,null,null,null,null,null,null,null,null,null,null,null,null,"--",0,null,null,{"$f":"(K359/Instructions!$C$23)*100","v":0},{"$f":"(L359/Instructions!$C$24)*100","v":0},{"$f":"(M359/Instructions!$C$25)*100","v":0},{"$f":"(N359/Instructions!$C$26)*100","v":0},{"$f":"(O359/Instructions!$C$27)*100","v":0},{"$f":"(P359/Instructions!$C$28)*100","v":0},{"$f":"(Q359/Instructions!$C$29)*100","v":0},{"$f":"(R359/Instructions!$C$30)*100","v":0},{"$f":"(S359/Instructions!$C$31)*100","v":0},{"$f":"(T359/Instructions!$C$30)*100","v":0},{"$f":"(U359/Instructions!$C$33)*100","v":{"$error":"#VALUE!"}},"----","E","E","E","E","E","E","E","E","E","E","--",null,null,null,null,null,{"$f":"Table_2[[#This Row],[Column51]]&Table_2[[#This Row],[Column52]]&AW361","v":""}]
[359,null,null,null,null,null,null,null,null,null,null,null,null,null,null,null,null,null,null,null,"--",0,null,null,{"$f":"(K360/Instructions!$C$23)*100","v":0},{"$f":"(L360/Instructions!$C$24)*100","v":0},{"$f":"(M360/Instructions!$C$25)*100","v":0},{"$f":"(N360/Instructions!$C$26)*100","v":0},{"$f":"(O360/Instructions!$C$27)*100","v":0},{"$f":"(P360/Instructions!$C$28)*100","v":0},{"$f":"(Q360/Instructions!$C$29)*100","v":0},{"$f":"(R360/Instructions!$C$30)*100","v":0},{"$f":"(S360/Instructions!$C$31)*100","v":0},{"$f":"(T360/Instructions!$C$30)*100","v":0},{"$f":"(U360/Instructions!$C$33)*100","v":{"$error":"#VALUE!"}},"----","E","E","E","E","E","E","E","E","E","E","--",null,null,null,null,null,{"$f":"Table_2[[#This Row],[Column51]]&Table_2[[#This Row],[Column52]]&AW362","v":""}]
[360,null,null,null,null,null,null,null,null,null,null,null,null,null,null,null,null,null,null,null,"--",0,null,null,{"$f":"(K361/Instructions!$C$23)*100","v":0},{"$f":"(L361/Instructions!$C$24)*100","v":0},{"$f":"(M361/Instructions!$C$25)*100","v":0},{"$f":"(N361/Instructions!$C$26)*100","v":0},{"$f":"(O361/Instructions!$C$27)*100","v":0},{"$f":"(P361/Instructions!$C$28)*100","v":0},{"$f":"(Q361/Instructions!$C$29)*100","v":0},{"$f":"(R361/Instructions!$C$30)*100","v":0},{"$f":"(S361/Instructions!$C$31)*100","v":0},{"$f":"(T361/Instructions!$C$30)*100","v":0},{"$f":"(U361/Instructions!$C$33)*100","v":{"$error":"#VALUE!"}},"----","E","E","E","E","E","E","E","E","E","E","--",null,null,null,null,null,{"$f":"Table_2[[#This Row],[Column51]]&Table_2[[#This Row],[Column52]]&AW363","v":""}]
[361,null,null,null,null,null,null,null,null,null,null,null,null,null,null,null,null,null,null,null,"--",0,null,null,{"$f":"(K362/Instructions!$C$23)*100","v":0},{"$f":"(L362/Instructions!$C$24)*100","v":0},{"$f":"(M362/Instructions!$C$25)*100","v":0},{"$f":"(N362/Instructions!$C$26)*100","v":0},{"$f":"(O362/Instructions!$C$27)*100","v":0},{"$f":"(P362/Instructions!$C$28)*100","v":0},{"$f":"(Q362/Instructions!$C$29)*100","v":0},{"$f":"(R362/Instructions!$C$30)*100","v":0},{"$f":"(S362/Instructions!$C$31)*100","v":0},{"$f":"(T362/Instructions!$C$30)*100","v":0},{"$f":"(U362/Instructions!$C$33)*100","v":{"$error":"#VALUE!"}},"----","E","E","E","E","E","E","E","E","E","E","--",null,null,null,null,null,{"$f":"Table_2[[#This Row],[Column51]]&Table_2[[#This Row],[Column52]]&AW364","v":""}]
[362,null,null,null,null,null,null,null,null,null,null,null,null,null,null,null,null,null,null,null,"--",0,null,null,{"$f":"(K363/Instructions!$C$23)*100","v":0},{"$f":"(L363/Instructions!$C$24)*100","v":0},{"$f":"(M363/Instructions!$C$25)*100","v":0},{"$f":"(N363/Instructions!$C$26)*100","v":0},{"$f":"(O363/Instructions!$C$27)*100","v":0},{"$f":"(P363/Instructions!$C$28)*100","v":0},{"$f":"(Q363/Instructions!$C$29)*100","v":0},{"$f":"(R363/Instructions!$C$30)*100","v":0},{"$f":"(S363/Instructions!$C$31)*100","v":0},{"$f":"(T363/Instructions!$C$30)*100","v":0},{"$f":"(U363/Instructions!$C$33)*100","v":{"$error":"#VALUE!"}},"----","E","E","E","E","E","E","E","E","E","E","--",null,null,null,null,null,{"$f":"Table_2[[#This Row],[Column51]]&Table_2[[#This Row],[Column52]]&AW365","v":""}]
[363,null,null,null,null,null,null,null,null,null,null,null,null,null,null,null,null,null,null,null,"--",0,null,null,{"$f":"(K364/Instructions!$C$23)*100","v":0},{"$f":"(L364/Instructions!$C$24)*100","v":0},{"$f":"(M364/Instructions!$C$25)*100","v":0},{"$f":"(N364/Instructions!$C$26)*100","v":0},{"$f":"(O364/Instructions!$C$27)*100","v":0},{"$f":"(P364/Instructions!$C$28)*100","v":0},{"$f":"(Q364/Instructions!$C$29)*100","v":0},{"$f":"(R364/Instructions!$C$30)*100","v":0},{"$f":"(S364/Instructions!$C$31)*100","v":0},{"$f":"(T364/Instructions!$C$30)*100","v":0},{"$f":"(U364/Instructions!$C$33)*100","v":{"$error":"#VALUE!"}},"----","E","E","E","E","E","E","E","E","E","E","--",null,null,null,null,null,{"$f":"Table_2[[#This Row],[Column51]]&Table_2[[#This Row],[Column52]]&AW366","v":""}]
[364,null,null,null,null,null,null,null,null,null,null,null,null,null,null,null,null,null,null,null,"--",0,null,null,{"$f":"(K365/Instructions!$C$23)*100","v":0},{"$f":"(L365/Instructions!$C$24)*100","v":0},{"$f":"(M365/Instructions!$C$25)*100","v":0},{"$f":"(N365/Instructions!$C$26)*100","v":0},{"$f":"(O365/Instructions!$C$27)*100","v":0},{"$f":"(P365/Instructions!$C$28)*100","v":0},{"$f":"(Q365/Instructions!$C$29)*100","v":0},{"$f":"(R365/Instructions!$C$30)*100","v":0},{"$f":"(S365/Instructions!$C$31)*100","v":0},{"$f":"(T365/Instructions!$C$30)*100","v":0},{"$f":"(U365/Instructions!$C$33)*100","v":{"$error":"#VALUE!"}},"----","E","E","E","E","E","E","E","E","E","E","--",null,null,null,null,null,{"$f":"Table_2[[#This Row],[Column51]]&Table_2[[#This Row],[Column52]]&AW367","v":""}]
[365,null,null,null,null,null,null,null,null,null,null,null,null,null,null,null,null,null,null,null,"--",0,null,null,{"$f":"(K366/Instructions!$C$23)*100","v":0},{"$f":"(L366/Instructions!$C$24)*100","v":0},{"$f":"(M366/Instructions!$C$25)*100","v":0},{"$f":"(N366/Instructions!$C$26)*100","v":0},{"$f":"(O366/Instructions!$C$27)*100","v":0},{"$f":"(P366/Instructions!$C$28)*100","v":0},{"$f":"(Q366/Instructions!$C$29)*100","v":0},{"$f":"(R366/Instructions!$C$30)*100","v":0},{"$f":"(S366/Instructions!$C$31)*100","v":0},{"$f":"(T366/Instructions!$C$30)*100","v":0},{"$f":"(U366/Instructions!$C$33)*100","v":{"$error":"#VALUE!"}},"----","E","E","E","E","E","E","E","E","E","E","--",null,null,null,null,null,{"$f":"Table_2[[#This Row],[Column51]]&Table_2[[#This Row],[Column52]]&AW368","v":""}]
[366,null,null,null,null,null,null,null,null,null,null,null,null,null,null,null,null,null,null,null,"--",0,null,null,{"$f":"(K367/Instructions!$C$23)*100","v":0},{"$f":"(L367/Instructions!$C$24)*100","v":0},{"$f":"(M367/Instructions!$C$25)*100","v":0},{"$f":"(N367/Instructions!$C$26)*100","v":0},{"$f":"(O367/Instructions!$C$27)*100","v":0},{"$f":"(P367/Instructions!$C$28)*100","v":0},{"$f":"(Q367/Instructions!$C$29)*100","v":0},{"$f":"(R367/Instructions!$C$30)*100","v":0},{"$f":"(S367/Instructions!$C$31)*100","v":0},{"$f":"(T367/Instructions!$C$30)*100","v":0},{"$f":"(U367/Instructions!$C$33)*100","v":{"$error":"#VALUE!"}},"----","E","E","E","E","E","E","E","E","E","E","--",null,null,null,null,null,{"$f":"Table_2[[#This Row],[Column51]]&Table_2[[#This Row],[Column52]]&AW369","v":""}]
[367,null,null,null,null,null,null,null,null,null,null,null,null,null,null,null,null,null,null,null,"--",0,null,null,{"$f":"(K368/Instructions!$C$23)*100","v":0},{"$f":"(L368/Instructions!$C$24)*100","v":0},{"$f":"(M368/Instructions!$C$25)*100","v":0},{"$f":"(N368/Instructions!$C$26)*100","v":0},{"$f":"(O368/Instructions!$C$27)*100","v":0},{"$f":"(P368/Instructions!$C$28)*100","v":0},{"$f":"(Q368/Instructions!$C$29)*100","v":0},{"$f":"(R368/Instructions!$C$30)*100","v":0},{"$f":"(S368/Instructions!$C$31)*100","v":0},{"$f":"(T368/Instructions!$C$30)*100","v":0},{"$f":"(U368/Instructions!$C$33)*100","v":{"$error":"#VALUE!"}},"----","E","E","E","E","E","E","E","E","E","E","--",null,null,null,null,null,{"$f":"Table_2[[#This Row],[Column51]]&Table_2[[#This Row],[Column52]]&AW370","v":""}]
[368,null,null,null,null,null,null,null,null,null,null,null,null,null,null,null,null,null,null,null,"--",0,null,null,{"$f":"(K369/Instructions!$C$23)*100","v":0},{"$f":"(L369/Instructions!$C$24)*100","v":0},{"$f":"(M369/Instructions!$C$25)*100","v":0},{"$f":"(N369/Instructions!$C$26)*100","v":0},{"$f":"(O369/Instructions!$C$27)*100","v":0},{"$f":"(P369/Instructions!$C$28)*100","v":0},{"$f":"(Q369/Instructions!$C$29)*100","v":0},{"$f":"(R369/Instructions!$C$30)*100","v":0},{"$f":"(S369/Instructions!$C$31)*100","v":0},{"$f":"(T369/Instructions!$C$30)*100","v":0},{"$f":"(U369/Instructions!$C$33)*100","v":{"$error":"#VALUE!"}},"----","E","E","E","E","E","E","E","E","E","E","--",null,null,null,null,null,{"$f":"Table_2[[#This Row],[Column51]]&Table_2[[#This Row],[Column52]]&AW371","v":""}]
[369,null,null,null,null,null,null,null,null,null,null,null,null,null,null,null,null,null,null,null,"--",0,null,null,{"$f":"(K370/Instructions!$C$23)*100","v":0},{"$f":"(L370/Instructions!$C$24)*100","v":0},{"$f":"(M370/Instructions!$C$25)*100","v":0},{"$f":"(N370/Instructions!$C$26)*100","v":0},{"$f":"(O370/Instructions!$C$27)*100","v":0},{"$f":"(P370/Instructions!$C$28)*100","v":0},{"$f":"(Q370/Instructions!$C$29)*100","v":0},{"$f":"(R370/Instructions!$C$30)*100","v":0},{"$f":"(S370/Instructions!$C$31)*100","v":0},{"$f":"(T370/Instructions!$C$30)*100","v":0},{"$f":"(U370/Instructions!$C$33)*100","v":{"$error":"#VALUE!"}},"----","E","E","E","E","E","E","E","E","E","E","--",null,null,null,null,null,{"$f":"Table_2[[#This Row],[Column51]]&Table_2[[#This Row],[Column52]]&AW372","v":""}]
[370,null,null,null,null,null,null,null,null,null,null,null,null,null,null,null,null,null,null,null,"--",0,null,null,{"$f":"(K371/Instructions!$C$23)*100","v":0},{"$f":"(L371/Instructions!$C$24)*100","v":0},{"$f":"(M371/Instructions!$C$25)*100","v":0},{"$f":"(N371/Instructions!$C$26)*100","v":0},{"$f":"(O371/Instructions!$C$27)*100","v":0},{"$f":"(P371/Instructions!$C$28)*100","v":0},{"$f":"(Q371/Instructions!$C$29)*100","v":0},{"$f":"(R371/Instructions!$C$30)*100","v":0},{"$f":"(S371/Instructions!$C$31)*100","v":0},{"$f":"(T371/Instructions!$C$30)*100","v":0},{"$f":"(U371/Instructions!$C$33)*100","v":{"$error":"#VALUE!"}},{"$f":"IF(AND(Y371>=33,Z371>=33,AA371>=33,AB371>=33,AC371>=33,AD371>=33),\"PASS\",\"----\")","v":"----"},"E","E","E","E","E","E","E","E","E","E","--",null,null,null,null,null,{"$f":"Table_2[[#This Row],[Column51]]&Table_2[[#This Row],[Column52]]&AW373","v":""}]
[371,null,null,null,null,null,null,null,null,null,null,null,null,null,null,null,null,null,null,null,"--",0,null,null,{"$f":"(K372/Instructions!$C$23)*100","v":0},{"$f":"(L372/Instructions!$C$24)*100","v":0},{"$f":"(M372/Instructions!$C$25)*100","v":0},{"$f":"(N372/Instructions!$C$26)*100","v":0},{"$f":"(O372/Instructions!$C$27)*100","v":0},{"$f":"(P372/Instructions!$C$28)*100","v":0},{"$f":"(Q372/Instructions!$C$29)*100","v":0},{"$f":"(R372/Instructions!$C$30)*100","v":0},{"$f":"(S372/Instructions!$C$31)*100","v":0},{"$f":"(T372/Instructions!$C$30)*100","v":0},{"$f":"(U372/Instructions!$C$33)*100","v":{"$error":"#VALUE!"}},"----",{"$f":"IFERROR(IF(Y372>90,\"A+\",IF(Y372>80,\"A\",IF(Y372>70,\"B+\",IF(Y372>60,\"B\",IF(Y372>50,\"C+\",IF(Y372>40,\"C\",IF(Y372>=33,\"D\",\"E\"))))))),\"Abs\")","v":"E"},{"$f":"IFERROR(IF(Z372>90,\"A+\",IF(Z372>80,\"A\",IF(Z372>70,\"B+\",IF(Z372>60,\"B\",IF(Z372>50,\"C+\",IF(Z372>40,\"C\",IF(Z372>=33,\"D\",\"E\"))))))),\"Abs\")","v":"E"},{"$f":"IFERROR(IF(AA372>90,\"A+\",IF(AA372>80,\"A\",IF(AA372>70,\"B+\",IF(AA372>60,\"B\",IF(AA372>50,\"C+\",IF(AA372>40,\"C\",IF(AA372>=33,\"D\",\"E\"))))))),\"Abs\")","v":"E"},{"$f":"IFERROR(IF(AB372>90,\"A+\",IF(AB372>80,\"A\",IF(AB372>70,\"B+\",IF(AB372>60,\"B\",IF(AB372>50,\"C+\",IF(AB372>40,\"C\",IF(AB372>=33,\"D\",\"E\"))))))),\"Abs\")","v":"E"},{"$f":"IFERROR(IF(AC372>90,\"A+\",IF(AC372>80,\"A\",IF(AC372>70,\"B+\",IF(AC372>60,\"B\",IF(AC372>50,\"C+\",IF(AC372>40,\"C\",IF(AC372>=33,\"D\",\"E\"))))))),\"Abs\")","v":"E"},{"$f":"IFERROR(IF(AD372>90,\"A+\",IF(AD372>80,\"A\",IF(AD372>70,\"B+\",IF(AD372>60,\"B\",IF(AD372>50,\"C+\",IF(AD372>40,\"C\",IF(AD372>=33,\"D\",\"E\"))))))),\"Abs\")","v":"E"},{"$f":"IFERROR(IF(AE372>90,\"A+\",IF(AE372>80,\"A\",IF(AE372>70,\"B+\",IF(AE372>60,\"B\",IF(AE372>50,\"C+\",IF(AE372>40,\"C\",IF(AE372>=33,\"D\",\"E\"))))))),\"Abs\")","v":"E"},{"$f":"IFERROR(IF(AF372>90,\"A+\",IF(AF372>80,\"A\",IF(AF372>70,\"B+\",IF(AF372>60,\"B\",IF(AF372>50,\"C+\",IF(AF372>40,\"C\",IF(AF372>=33,\"D\",\"E\"))))))),\"Abs\")","v":"E"},{"$f":"IFERROR(IF(AG372>90,\"A+\",IF(AG372>80,\"A\",IF(AG372>70,\"B+\",IF(AG372>60,\"B\",IF(AG372>50,\"C+\",IF(AG372>40,\"C\",IF(AG372>=33,\"D\",\"E\"))))))),\"Abs\")","v":"E"},{"$f":"IFERROR(IF(AH372>90,\"A+\",IF(AH372>80,\"A\",IF(AH372>70,\"B+\",IF(AH372>60,\"B\",IF(AH372>50,\"C+\",IF(AH372>40,\"C\",IF(AH372>=33,\"D\",\"E\"))))))),\"Abs\")","v":"E"},"--",null,null,null,null,null,{"$f":"Table_2[[#This Row],[Column51]]&Table_2[[#This Row],[Column52]]&AW374","v":""}]
[372,null,null,null,null,null,null,null,null,null,null,null,null,null,null,null,null,null,null,null,"--",0,null,null,{"$f":"(K373/Instructions!$C$23)*100","v":0},{"$f":"(L373/Instructions!$C$24)*100","v":0},{"$f":"(M373/Instructions!$C$25)*100","v":0},{"$f":"(N373/Instructions!$C$26)*100","v":0},{"$f":"(O373/Instructions!$C$27)*100","v":0},{"$f":"(P373/Instructions!$C$28)*100","v":0},{"$f":"(Q373/Instructions!$C$29)*100","v":0},{"$f":"(R373/Instructions!$C$30)*100","v":0},{"$f":"(S373/Instructions!$C$31)*100","v":0},{"$f":"(T373/Instructions!$C$30)*100","v":0},{"$f":"(U373/Instructions!$C$33)*100","v":{"$error":"#VALUE!"}},"----","E","E","E","E","E","E","E","E","E","E","--",null,null,null,null,null,{"$f":"Table_2[[#This Row],[Column51]]&Table_2[[#This Row],[Column52]]&AW375","v":""}]
[373,null,null,null,null,null,null,null,null,null,null,null,null,null,null,null,null,null,null,null,"--",0,null,null,{"$f":"(K374/Instructions!$C$23)*100","v":0},{"$f":"(L374/Instructions!$C$24)*100","v":0},{"$f":"(M374/Instructions!$C$25)*100","v":0},{"$f":"(N374/Instructions!$C$26)*100","v":0},{"$f":"(O374/Instructions!$C$27)*100","v":0},{"$f":"(P374/Instructions!$C$28)*100","v":0},{"$f":"(Q374/Instructions!$C$29)*100","v":0},{"$f":"(R374/Instructions!$C$30)*100","v":0},{"$f":"(S374/Instructions!$C$31)*100","v":0},{"$f":"(T374/Instructions!$C$30)*100","v":0},{"$f":"(U374/Instructions!$C$33)*100","v":{"$error":"#VALUE!"}},"----","E","E","E","E","E","E","E","E","E","E","--",null,null,null,null,null,{"$f":"Table_2[[#This Row],[Column51]]&Table_2[[#This Row],[Column52]]&AW376","v":""}]
[374,null,null,null,null,null,null,null,null,null,null,null,null,null,null,null,null,null,null,null,"--",0,null,null,{"$f":"(K375/Instructions!$C$23)*100","v":0},{"$f":"(L375/Instructions!$C$24)*100","v":0},{"$f":"(M375/Instructions!$C$25)*100","v":0},{"$f":"(N375/Instructions!$C$26)*100","v":0},{"$f":"(O375/Instructions!$C$27)*100","v":0},{"$f":"(P375/Instructions!$C$28)*100","v":0},{"$f":"(Q375/Instructions!$C$29)*100","v":0},{"$f":"(R375/Instructions!$C$30)*100","v":0},{"$f":"(S375/Instructions!$C$31)*100","v":0},{"$f":"(T375/Instructions!$C$30)*100","v":0},{"$f":"(U375/Instructions!$C$33)*100","v":{"$error":"#VALUE!"}},"----","E","E","E","E","E","E","E","E","E","E","--",null,null,null,null,null,{"$f":"Table_2[[#This Row],[Column51]]&Table_2[[#This Row],[Column52]]&AW377","v":""}]
[375,null,null,null,null,null,null,null,null,null,null,null,null,null,null,null,null,null,null,null,"--",0,null,null,{"$f":"(K376/Instructions!$C$23)*100","v":0},{"$f":"(L376/Instructions!$C$24)*100","v":0},{"$f":"(M376/Instructions!$C$25)*100","v":0},{"$f":"(N376/Instructions!$C$26)*100","v":0},{"$f":"(O376/Instructions!$C$27)*100","v":0},{"$f":"(P376/Instructions!$C$28)*100","v":0},{"$f":"(Q376/Instructions!$C$29)*100","v":0},{"$f":"(R376/Instructions!$C$30)*100","v":0},{"$f":"(S376/Instructions!$C$31)*100","v":0},{"$f":"(T376/Instructions!$C$30)*100","v":0},{"$f":"(U376/Instructions!$C$33)*100","v":{"$error":"#VALUE!"}},"----","E","E","E","E","E","E","E","E","E","E","--",null,null,null,null,null,{"$f":"Table_2[[#This Row],[Column51]]&Table_2[[#This Row],[Column52]]&AW378","v":""}]
[376,null,null,null,null,null,null,null,null,null,null,null,null,null,null,null,null,null,null,null,"--",0,null,null,{"$f":"(K377/Instructions!$C$23)*100","v":0},{"$f":"(L377/Instructions!$C$24)*100","v":0},{"$f":"(M377/Instructions!$C$25)*100","v":0},{"$f":"(N377/Instructions!$C$26)*100","v":0},{"$f":"(O377/Instructions!$C$27)*100","v":0},{"$f":"(P377/Instructions!$C$28)*100","v":0},{"$f":"(Q377/Instructions!$C$29)*100","v":0},{"$f":"(R377/Instructions!$C$30)*100","v":0},{"$f":"(S377/Instructions!$C$31)*100","v":0},{"$f":"(T377/Instructions!$C$30)*100","v":0},{"$f":"(U377/Instructions!$C$33)*100","v":{"$error":"#VALUE!"}},"----","E","E","E","E","E","E","E","E","E","E","--",null,null,null,null,null,{"$f":"Table_2[[#This Row],[Column51]]&Table_2[[#This Row],[Column52]]&AW379","v":""}]
[377,null,null,null,null,null,null,null,null,null,null,null,null,null,null,null,null,null,null,null,"--",0,null,null,{"$f":"(K378/Instructions!$C$23)*100","v":0},{"$f":"(L378/Instructions!$C$24)*100","v":0},{"$f":"(M378/Instructions!$C$25)*100","v":0},{"$f":"(N378/Instructions!$C$26)*100","v":0},{"$f":"(O378/Instructions!$C$27)*100","v":0},{"$f":"(P378/Instructions!$C$28)*100","v":0},{"$f":"(Q378/Instructions!$C$29)*100","v":0},{"$f":"(R378/Instructions!$C$30)*100","v":0},{"$f":"(S378/Instructions!$C$31)*100","v":0},{"$f":"(T378/Instructions!$C$30)*100","v":0},{"$f":"(U378/Instructions!$C$33)*100","v":{"$error":"#VALUE!"}},"----","E","E","E","E","E","E","E","E","E","E","--",null,null,null,null,null,{"$f":"Table_2[[#This Row],[Column51]]&Table_2[[#This Row],[Column52]]&AW380","v":""}]
[378,null,null,null,null,null,null,null,null,null,null,null,null,null,null,null,null,null,null,null,"--",0,null,null,{"$f":"(K379/Instructions!$C$23)*100","v":0},{"$f":"(L379/Instructions!$C$24)*100","v":0},{"$f":"(M379/Instructions!$C$25)*100","v":0},{"$f":"(N379/Instructions!$C$26)*100","v":0},{"$f":"(O379/Instructions!$C$27)*100","v":0},{"$f":"(P379/Instructions!$C$28)*100","v":0},{"$f":"(Q379/Instructions!$C$29)*100","v":0},{"$f":"(R379/Instructions!$C$30)*100","v":0},{"$f":"(S379/Instructions!$C$31)*100","v":0},{"$f":"(T379/Instructions!$C$30)*100","v":0},{"$f":"(U379/Instructions!$C$33)*100","v":{"$error":"#VALUE!"}},"----","E","E","E","E","E","E","E","E","E","E","--",null,null,null,null,null,{"$f":"Table_2[[#This Row],[Column51]]&Table_2[[#This Row],[Column52]]&AW381","v":""}]
[379,null,null,null,null,null,null,null,null,null,null,null,null,null,null,null,null,null,null,null,"--",0,null,null,{"$f":"(K380/Instructions!$C$23)*100","v":0},{"$f":"(L380/Instructions!$C$24)*100","v":0},{"$f":"(M380/Instructions!$C$25)*100","v":0},{"$f":"(N380/Instructions!$C$26)*100","v":0},{"$f":"(O380/Instructions!$C$27)*100","v":0},{"$f":"(P380/Instructions!$C$28)*100","v":0},{"$f":"(Q380/Instructions!$C$29)*100","v":0},{"$f":"(R380/Instructions!$C$30)*100","v":0},{"$f":"(S380/Instructions!$C$31)*100","v":0},{"$f":"(T380/Instructions!$C$30)*100","v":0},{"$f":"(U380/Instructions!$C$33)*100","v":{"$error":"#VALUE!"}},"----","E","E","E","E","E","E","E","E","E","E","--",null,null,null,null,null,{"$f":"Table_2[[#This Row],[Column51]]&Table_2[[#This Row],[Column52]]&AW382","v":""}]
[380,null,null,null,null,null,null,null,null,null,null,null,null,null,null,null,null,null,null,null,"--",0,null,null,{"$f":"(K381/Instructions!$C$23)*100","v":0},{"$f":"(L381/Instructions!$C$24)*100","v":0},{"$f":"(M381/Instructions!$C$25)*100","v":0},{"$f":"(N381/Instructions!$C$26)*100","v":0},{"$f":"(O381/Instructions!$C$27)*100","v":0},{"$f":"(P381/Instructions!$C$28)*100","v":0},{"$f":"(Q381/Instructions!$C$29)*100","v":0},{"$f":"(R381/Instructions!$C$30)*100","v":0},{"$f":"(S381/Instructions!$C$31)*100","v":0},{"$f":"(T381/Instructions!$C$30)*100","v":0},{"$f":"(U381/Instructions!$C$33)*100","v":{"$error":"#VALUE!"}},"----","E","E","E","E","E","E","E","E","E","E","--",null,null,null,null,null,{"$f":"Table_2[[#This Row],[Column51]]&Table_2[[#This Row],[Column52]]&AW383","v":""}]
[381,null,null,null,null,null,null,null,null,null,null,null,null,null,null,null,null,null,null,null,"--",0,null,null,{"$f":"(K382/Instructions!$C$23)*100","v":0},{"$f":"(L382/Instructions!$C$24)*100","v":0},{"$f":"(M382/Instructions!$C$25)*100","v":0},{"$f":"(N382/Instructions!$C$26)*100","v":0},{"$f":"(O382/Instructions!$C$27)*100","v":0},{"$f":"(P382/Instructions!$C$28)*100","v":0},{"$f":"(Q382/Instructions!$C$29)*100","v":0},{"$f":"(R382/Instructions!$C$30)*100","v":0},{"$f":"(S382/Instructions!$C$31)*100","v":0},{"$f":"(T382/Instructions!$C$30)*100","v":0},{"$f":"(U382/Instructions!$C$33)*100","v":{"$error":"#VALUE!"}},"----","E","E","E","E","E","E","E","E","E","E","--",null,null,null,null,null,{"$f":"Table_2[[#This Row],[Column51]]&Table_2[[#This Row],[Column52]]&AW384","v":""}]
[382,null,null,null,null,null,null,null,null,null,null,null,null,null,null,null,null,null,null,null,"--",0,null,null,{"$f":"(K383/Instructions!$C$23)*100","v":0},{"$f":"(L383/Instructions!$C$24)*100","v":0},{"$f":"(M383/Instructions!$C$25)*100","v":0},{"$f":"(N383/Instructions!$C$26)*100","v":0},{"$f":"(O383/Instructions!$C$27)*100","v":0},{"$f":"(P383/Instructions!$C$28)*100","v":0},{"$f":"(Q383/Instructions!$C$29)*100","v":0},{"$f":"(R383/Instructions!$C$30)*100","v":0},{"$f":"(S383/Instructions!$C$31)*100","v":0},{"$f":"(T383/Instructions!$C$30)*100","v":0},{"$f":"(U383/Instructions!$C$33)*100","v":{"$error":"#VALUE!"}},"----","E","E","E","E","E","E","E","E","E","E","--",null,null,null,null,null,{"$f":"Table_2[[#This Row],[Column51]]&Table_2[[#This Row],[Column52]]&AW385","v":""}]
[383,null,null,null,null,null,null,null,null,null,null,null,null,null,null,null,null,null,null,null,"--",0,null,null,{"$f":"(K384/Instructions!$C$23)*100","v":0},{"$f":"(L384/Instructions!$C$24)*100","v":0},{"$f":"(M384/Instructions!$C$25)*100","v":0},{"$f":"(N384/Instructions!$C$26)*100","v":0},{"$f":"(O384/Instructions!$C$27)*100","v":0},{"$f":"(P384/Instructions!$C$28)*100","v":0},{"$f":"(Q384/Instructions!$C$29)*100","v":0},{"$f":"(R384/Instructions!$C$30)*100","v":0},{"$f":"(S384/Instructions!$C$31)*100","v":0},{"$f":"(T384/Instructions!$C$30)*100","v":0},{"$f":"(U384/Instructions!$C$33)*100","v":{"$error":"#VALUE!"}},"----","E","E","E","E","E","E","E","E","E","E","--",null,null,null,null,null,{"$f":"Table_2[[#This Row],[Column51]]&Table_2[[#This Row],[Column52]]&AW386","v":""}]
[384,null,null,null,null,null,null,null,null,null,null,null,null,null,null,null,null,null,null,null,"--",0,null,null,{"$f":"(K385/Instructions!$C$23)*100","v":0},{"$f":"(L385/Instructions!$C$24)*100","v":0},{"$f":"(M385/Instructions!$C$25)*100","v":0},{"$f":"(N385/Instructions!$C$26)*100","v":0},{"$f":"(O385/Instructions!$C$27)*100","v":0},{"$f":"(P385/Instructions!$C$28)*100","v":0},{"$f":"(Q385/Instructions!$C$29)*100","v":0},{"$f":"(R385/Instructions!$C$30)*100","v":0},{"$f":"(S385/Instructions!$C$31)*100","v":0},{"$f":"(T385/Instructions!$C$30)*100","v":0},{"$f":"(U385/Instructions!$C$33)*100","v":{"$error":"#VALUE!"}},"----","E","E","E","E","E","E","E","E","E","E","--",null,null,null,null,null,{"$f":"Table_2[[#This Row],[Column51]]&Table_2[[#This Row],[Column52]]&AW387","v":""}]
[385,null,null,null,null,null,null,null,null,null,null,null,null,null,null,null,null,null,null,null,"--",0,null,null,{"$f":"(K386/Instructions!$C$23)*100","v":0},{"$f":"(L386/Instructions!$C$24)*100","v":0},{"$f":"(M386/Instructions!$C$25)*100","v":0},{"$f":"(N386/Instructions!$C$26)*100","v":0},{"$f":"(O386/Instructions!$C$27)*100","v":0},{"$f":"(P386/Instructions!$C$28)*100","v":0},{"$f":"(Q386/Instructions!$C$29)*100","v":0},{"$f":"(R386/Instructions!$C$30)*100","v":0},{"$f":"(S386/Instructions!$C$31)*100","v":0},{"$f":"(T386/Instructions!$C$30)*100","v":0},{"$f":"(U386/Instructions!$C$33)*100","v":{"$error":"#VALUE!"}},"----","E","E","E","E","E","E","E","E","E","E","--",null,null,null,null,null,{"$f":"Table_2[[#This Row],[Column51]]&Table_2[[#This Row],[Column52]]&AW388","v":""}]
[386,null,null,null,null,null,null,null,null,null,null,null,null,null,null,null,null,null,null,null,{"$f":"IF(MIN(Y387:AD387)>=33,SUM(K387:P387),\"--\")","v":"--"},{"$f":"IF(U387=\"--\",0,U387)","v":0},null,null,{"$f":"(K387/Instructions!$C$23)*100","v":0},{"$f":"(L387/Instructions!$C$24)*100","v":0},{"$f":"(M387/Instructions!$C$25)*100","v":0},{"$f":"(N387/Instructions!$C$26)*100","v":0},{"$f":"(O387/Instructions!$C$27)*100","v":0},{"$f":"(P387/Instructions!$C$28)*100","v":0},{"$f":"(Q387/Instructions!$C$29)*100","v":0},{"$f":"(R387/Instructions!$C$30)*100","v":0},{"$f":"(S387/Instructions!$C$31)*100","v":0},{"$f":"(T387/Instructions!$C$30)*100","v":0},{"$f":"(U387/Instructions!$C$33)*100","v":{"$error":"#VALUE!"}},"----","E","E","E","E","E","E","E","E","E","E",{"$f":"IFERROR(IF(AI387>90,\"A+\",IF(AI387>80,\"A\",IF(AI387>70,\"B+\",IF(AI387>60,\"B\",IF(AI387>50,\"C+\",IF(AI387>40,\"C\",IF(AI387>=33,\"D\",\"E\"))))))),\"--\")","v":"--"},null,null,null,null,null,{"$f":"Table_2[[#This Row],[Column51]]&Table_2[[#This Row],[Column52]]&AW389","v":""}]
[387,null,null,null,null,null,null,null,null,null,null,null,null,null,null,null,null,null,null,null,"--",0,null,null,{"$f":"(K388/Instructions!$C$23)*100","v":0},{"$f":"(L388/Instructions!$C$24)*100","v":0},{"$f":"(M388/Instructions!$C$25)*100","v":0},{"$f":"(N388/Instructions!$C$26)*100","v":0},{"$f":"(O388/Instructions!$C$27)*100","v":0},{"$f":"(P388/Instructions!$C$28)*100","v":0},{"$f":"(Q388/Instructions!$C$29)*100","v":0},{"$f":"(R388/Instructions!$C$30)*100","v":0},{"$f":"(S388/Instructions!$C$31)*100","v":0},{"$f":"(T388/Instructions!$C$30)*100","v":0},{"$f":"(U388/Instructions!$C$33)*100","v":{"$error":"#VALUE!"}},"----","E","E","E","E","E","E","E","E","E","E","--",null,null,null,null,null,{"$f":"Table_2[[#This Row],[Column51]]&Table_2[[#This Row],[Column52]]&AW390","v":""}]
[388,null,null,null,null,null,null,null,null,null,null,null,null,null,null,null,null,null,null,null,"--",0,null,null,{"$f":"(K389/Instructions!$C$23)*100","v":0},{"$f":"(L389/Instructions!$C$24)*100","v":0},{"$f":"(M389/Instructions!$C$25)*100","v":0},{"$f":"(N389/Instructions!$C$26)*100","v":0},{"$f":"(O389/Instructions!$C$27)*100","v":0},{"$f":"(P389/Instructions!$C$28)*100","v":0},{"$f":"(Q389/Instructions!$C$29)*100","v":0},{"$f":"(R389/Instructions!$C$30)*100","v":0},{"$f":"(S389/Instructions!$C$31)*100","v":0},{"$f":"(T389/Instructions!$C$30)*100","v":0},{"$f":"(U389/Instructions!$C$33)*100","v":{"$error":"#VALUE!"}},"----","E","E","E","E","E","E","E","E","E","E","--",null,null,null,null,null,{"$f":"Table_2[[#This Row],[Column51]]&Table_2[[#This Row],[Column52]]&AW391","v":""}]
[389,null,null,null,null,null,null,null,null,null,null,null,null,null,null,null,null,null,null,null,"--",0,null,null,{"$f":"(K390/Instructions!$C$23)*100","v":0},{"$f":"(L390/Instructions!$C$24)*100","v":0},{"$f":"(M390/Instructions!$C$25)*100","v":0},{"$f":"(N390/Instructions!$C$26)*100","v":0},{"$f":"(O390/Instructions!$C$27)*100","v":0},{"$f":"(P390/Instructions!$C$28)*100","v":0},{"$f":"(Q390/Instructions!$C$29)*100","v":0},{"$f":"(R390/Instructions!$C$30)*100","v":0},{"$f":"(S390/Instructions!$C$31)*100","v":0},{"$f":"(T390/Instructions!$C$30)*100","v":0},{"$f":"(U390/Instructions!$C$33)*100","v":{"$error":"#VALUE!"}},"----","E","E","E","E","E","E","E","E","E","E","--",null,null,null,null,null,{"$f":"Table_2[[#This Row],[Column51]]&Table_2[[#This Row],[Column52]]&AW392","v":""}]
[390,null,null,null,null,null,null,null,null,null,null,null,null,null,null,null,null,null,null,null,"--",0,null,null,{"$f":"(K391/Instructions!$C$23)*100","v":0},{"$f":"(L391/Instructions!$C$24)*100","v":0},{"$f":"(M391/Instructions!$C$25)*100","v":0},{"$f":"(N391/Instructions!$C$26)*100","v":0},{"$f":"(O391/Instructions!$C$27)*100","v":0},{"$f":"(P391/Instructions!$C$28)*100","v":0},{"$f":"(Q391/Instructions!$C$29)*100","v":0},{"$f":"(R391/Instructions!$C$30)*100","v":0},{"$f":"(S391/Instructions!$C$31)*100","v":0},{"$f":"(T391/Instructions!$C$30)*100","v":0},{"$f":"(U391/Instructions!$C$33)*100","v":{"$error":"#VALUE!"}},"----","E","E","E","E","E","E","E","E","E","E","--",null,null,null,null,null,{"$f":"Table_2[[#This Row],[Column51]]&Table_2[[#This Row],[Column52]]&AW393","v":""}]
[391,null,null,null,null,null,null,null,null,null,null,null,null,null,null,null,null,null,null,null,"--",0,null,null,{"$f":"(K392/Instructions!$C$23)*100","v":0},{"$f":"(L392/Instructions!$C$24)*100","v":0},{"$f":"(M392/Instructions!$C$25)*100","v":0},{"$f":"(N392/Instructions!$C$26)*100","v":0},{"$f":"(O392/Instructions!$C$27)*100","v":0},{"$f":"(P392/Instructions!$C$28)*100","v":0},{"$f":"(Q392/Instructions!$C$29)*100","v":0},{"$f":"(R392/Instructions!$C$30)*100","v":0},{"$f":"(S392/Instructions!$C$31)*100","v":0},{"$f":"(T392/Instructions!$C$30)*100","v":0},{"$f":"(U392/Instructions!$C$33)*100","v":{"$error":"#VALUE!"}},"----","E","E","E","E","E","E","E","E","E","E","--",null,null,null,null,null,{"$f":"Table_2[[#This Row],[Column51]]&Table_2[[#This Row],[Column52]]&AW394","v":""}]
[392,null,null,null,null,null,null,null,null,null,null,null,null,null,null,null,null,null,null,null,"--",0,null,null,{"$f":"(K393/Instructions!$C$23)*100","v":0},{"$f":"(L393/Instructions!$C$24)*100","v":0},{"$f":"(M393/Instructions!$C$25)*100","v":0},{"$f":"(N393/Instructions!$C$26)*100","v":0},{"$f":"(O393/Instructions!$C$27)*100","v":0},{"$f":"(P393/Instructions!$C$28)*100","v":0},{"$f":"(Q393/Instructions!$C$29)*100","v":0},{"$f":"(R393/Instructions!$C$30)*100","v":0},{"$f":"(S393/Instructions!$C$31)*100","v":0},{"$f":"(T393/Instructions!$C$30)*100","v":0},{"$f":"(U393/Instructions!$C$33)*100","v":{"$error":"#VALUE!"}},"----","E","E","E","E","E","E","E","E","E","E","--",null,null,null,null,null,{"$f":"Table_2[[#This Row],[Column51]]&Table_2[[#This Row],[Column52]]&AW395","v":""}]
[393,null,null,null,null,null,null,null,null,null,null,null,null,null,null,null,null,null,null,null,"--",0,null,null,{"$f":"(K394/Instructions!$C$23)*100","v":0},{"$f":"(L394/Instructions!$C$24)*100","v":0},{"$f":"(M394/Instructions!$C$25)*100","v":0},{"$f":"(N394/Instructions!$C$26)*100","v":0},{"$f":"(O394/Instructions!$C$27)*100","v":0},{"$f":"(P394/Instructions!$C$28)*100","v":0},{"$f":"(Q394/Instructions!$C$29)*100","v":0},{"$f":"(R394/Instructions!$C$30)*100","v":0},{"$f":"(S394/Instructions!$C$31)*100","v":0},{"$f":"(T394/Instructions!$C$30)*100","v":0},{"$f":"(U394/Instructions!$C$33)*100","v":{"$error":"#VALUE!"}},"----","E","E","E","E","E","E","E","E","E","E","--",null,null,null,null,null,{"$f":"Table_2[[#This Row],[Column51]]&Table_2[[#This Row],[Column52]]&AW396","v":""}]
[394,null,null,null,null,null,null,null,null,null,null,null,null,null,null,null,null,null,null,null,"--",0,null,null,{"$f":"(K395/Instructions!$C$23)*100","v":0},{"$f":"(L395/Instructions!$C$24)*100","v":0},{"$f":"(M395/Instructions!$C$25)*100","v":0},{"$f":"(N395/Instructions!$C$26)*100","v":0},{"$f":"(O395/Instructions!$C$27)*100","v":0},{"$f":"(P395/Instructions!$C$28)*100","v":0},{"$f":"(Q395/Instructions!$C$29)*100","v":0},{"$f":"(R395/Instructions!$C$30)*100","v":0},{"$f":"(S395/Instructions!$C$31)*100","v":0},{"$f":"(T395/Instructions!$C$30)*100","v":0},{"$f":"(U395/Instructions!$C$33)*100","v":{"$error":"#VALUE!"}},"----","E","E","E","E","E","E","E","E","E","E","--",null,null,null,null,null,{"$f":"Table_2[[#This Row],[Column51]]&Table_2[[#This Row],[Column52]]&AW397","v":""}]
[395,null,null,null,null,null,null,null,null,null,null,null,null,null,null,null,null,null,null,null,"--",0,null,null,{"$f":"(K396/Instructions!$C$23)*100","v":0},{"$f":"(L396/Instructions!$C$24)*100","v":0},{"$f":"(M396/Instructions!$C$25)*100","v":0},{"$f":"(N396/Instructions!$C$26)*100","v":0},{"$f":"(O396/Instructions!$C$27)*100","v":0},{"$f":"(P396/Instructions!$C$28)*100","v":0},{"$f":"(Q396/Instructions!$C$29)*100","v":0},{"$f":"(R396/Instructions!$C$30)*100","v":0},{"$f":"(S396/Instructions!$C$31)*100","v":0},{"$f":"(T396/Instructions!$C$30)*100","v":0},{"$f":"(U396/Instructions!$C$33)*100","v":{"$error":"#VALUE!"}},"----","E","E","E","E","E","E","E","E","E","E","--",null,null,null,null,null,{"$f":"Table_2[[#This Row],[Column51]]&Table_2[[#This Row],[Column52]]&AW398","v":""}]
[396,null,null,null,null,null,null,null,null,null,null,null,null,null,null,null,null,null,null,null,"--",0,null,null,{"$f":"(K397/Instructions!$C$23)*100","v":0},{"$f":"(L397/Instructions!$C$24)*100","v":0},{"$f":"(M397/Instructions!$C$25)*100","v":0},{"$f":"(N397/Instructions!$C$26)*100","v":0},{"$f":"(O397/Instructions!$C$27)*100","v":0},{"$f":"(P397/Instructions!$C$28)*100","v":0},{"$f":"(Q397/Instructions!$C$29)*100","v":0},{"$f":"(R397/Instructions!$C$30)*100","v":0},{"$f":"(S397/Instructions!$C$31)*100","v":0},{"$f":"(T397/Instructions!$C$30)*100","v":0},{"$f":"(U397/Instructions!$C$33)*100","v":{"$error":"#VALUE!"}},"----","E","E","E","E","E","E","E","E","E","E","--",null,null,null,null,null,{"$f":"Table_2[[#This Row],[Column51]]&Table_2[[#This Row],[Column52]]&AW399","v":""}]
[397,null,null,null,null,null,null,null,null,null,null,null,null,null,null,null,null,null,null,null,"--",0,null,null,{"$f":"(K398/Instructions!$C$23)*100","v":0},{"$f":"(L398/Instructions!$C$24)*100","v":0},{"$f":"(M398/Instructions!$C$25)*100","v":0},{"$f":"(N398/Instructions!$C$26)*100","v":0},{"$f":"(O398/Instructions!$C$27)*100","v":0},{"$f":"(P398/Instructions!$C$28)*100","v":0},{"$f":"(Q398/Instructions!$C$29)*100","v":0},{"$f":"(R398/Instructions!$C$30)*100","v":0},{"$f":"(S398/Instructions!$C$31)*100","v":0},{"$f":"(T398/Instructions!$C$30)*100","v":0},{"$f":"(U398/Instructions!$C$33)*100","v":{"$error":"#VALUE!"}},"----","E","E","E","E","E","E","E","E","E","E","--",null,null,null,null,null,{"$f":"Table_2[[#This Row],[Column51]]&Table_2[[#This Row],[Column52]]&AW400","v":""}]
[398,null,null,null,null,null,null,null,null,null,null,null,null,null,null,null,null,null,null,null,"--",0,null,null,{"$f":"(K399/Instructions!$C$23)*100","v":0},{"$f":"(L399/Instructions!$C$24)*100","v":0},{"$f":"(M399/Instructions!$C$25)*100","v":0},{"$f":"(N399/Instructions!$C$26)*100","v":0},{"$f":"(O399/Instructions!$C$27)*100","v":0},{"$f":"(P399/Instructions!$C$28)*100","v":0},{"$f":"(Q399/Instructions!$C$29)*100","v":0},{"$f":"(R399/Instructions!$C$30)*100","v":0},{"$f":"(S399/Instructions!$C$31)*100","v":0},{"$f":"(T399/Instructions!$C$30)*100","v":0},{"$f":"(U399/Instructions!$C$33)*100","v":{"$error":"#VALUE!"}},"----","E","E","E","E","E","E","E","E","E","E","--",null,null,null,null,null,{"$f":"Table_2[[#This Row],[Column51]]&Table_2[[#This Row],[Column52]]&AW401","v":""}]
[399,null,null,null,null,null,null,null,null,null,null,null,null,null,null,null,null,null,null,null,"--",0,null,null,{"$f":"(K400/Instructions!$C$23)*100","v":0},{"$f":"(L400/Instructions!$C$24)*100","v":0},{"$f":"(M400/Instructions!$C$25)*100","v":0},{"$f":"(N400/Instructions!$C$26)*100","v":0},{"$f":"(O400/Instructions!$C$27)*100","v":0},{"$f":"(P400/Instructions!$C$28)*100","v":0},{"$f":"(Q400/Instructions!$C$29)*100","v":0},{"$f":"(R400/Instructions!$C$30)*100","v":0},{"$f":"(S400/Instructions!$C$31)*100","v":0},{"$f":"(T400/Instructions!$C$30)*100","v":0},{"$f":"(U400/Instructions!$C$33)*100","v":{"$error":"#VALUE!"}},"----","E","E","E","E","E","E","E","E","E","E","--",null,null,null,null,null,{"$f":"Table_2[[#This Row],[Column51]]&Table_2[[#This Row],[Column52]]&AW402","v":""}]
[400,null,null,null,null,null,null,null,null,null,null,null,null,null,null,null,null,null,null,null,"--",0,null,null,{"$f":"(K401/Instructions!$C$23)*100","v":0},{"$f":"(L401/Instructions!$C$24)*100","v":0},{"$f":"(M401/Instructions!$C$25)*100","v":0},{"$f":"(N401/Instructions!$C$26)*100","v":0},{"$f":"(O401/Instructions!$C$27)*100","v":0},{"$f":"(P401/Instructions!$C$28)*100","v":0},{"$f":"(Q401/Instructions!$C$29)*100","v":0},{"$f":"(R401/Instructions!$C$30)*100","v":0},{"$f":"(S401/Instructions!$C$31)*100","v":0},{"$f":"(T401/Instructions!$C$30)*100","v":0},{"$f":"(U401/Instructions!$C$33)*100","v":{"$error":"#VALUE!"}},"----","E","E","E","E","E","E","E","E","E","E","--",null,null,null,null,null,{"$f":"Table_2[[#This Row],[Column51]]&Table_2[[#This Row],[Column52]]&AW403","v":""}]
[null,null,null,null,null,null,null,null,null,null,null,null,null,null,null,null,null,null,null,null,null,null,null,null,null,null,null,null,null,null,null,null,null,{"$f":"(T402/Instructions!$C$30)*100","v":0},null,null,null,null,null,null,null,null,null,null,null,null,null,null,null,null,null,null,{"$f":"Table_2[[#This Row],[Column51]]&Table_2[[#This Row],[Column52]]&AW404","v":""}]
[null,null,null,null,null,null,null,null,null,null,null,null,null,null,null,null,null,null,null,null,null,null,null,null,null,null,null,null,null,null,null,null,null,{"$f":"(T403/Instructions!$C$30)*100","v":0},null,null,null,null,null,null,null,null,null,null,null,null,null,null,null,null,null,null,{"$f":"Table_2[[#This Row],[Column51]]&Table_2[[#This Row],[Column52]]&AW405","v":""}]

{"sheet":"Report Card","index":2,"n_rows":39,"n_cols":18,"rows_kept":39,"cut":false,"hidden":false,"merged":[[5,0,5,10],[36,2,36,4],[30,1,30,4],[31,1,31,4],[32,1,32,4],[30,5,30,8],[31,5,31,8],[32,5,32,8],[26,1,26,9],[29,5,29,8],[29,1,29,4],[28,1,28,8],[7,4,7,7],[8,4,8,7],[8,8,8,9],[24,2,24,5],[20,2,20,5],[20,6,20,7],[24,6,24,7],[25,1,25,2],[25,3,25,4],[25,5,25,6],[23,2,23,5],[23,6,23,7],[1,0,1,3],[11,4,11,7],[11,8,11,9],[22,2,22,5],[22,6,22,7],[15,2,15,5],[15,6,15,7],[9,4,9,7],[9,8,9,9],[10,4,10,7],[10,8,10,9],[11,1,11,3],[12,1,12,9],[13,1,13,9],[14,2,14,5],[14,6,14,7],[38,8,38,10],[6,12,7,12],[9,1,9,3],[10,1,10,3],[7,1,7,3],[8,1,8,3],[21,2,21,5],[21,6,21,7],[16,2,16,5],[16,6,16,7],[17,2,17,5],[17,6,17,7],[18,2,18,5],[18,6,18,7],[19,2,19,5],[19,6,19,7]]}
[]
[{"$f":"\"        Serial No./\"&Q3&\"/\"&R3&\"/\"&N8","v":"        Serial No./March/2024/1"}]
[null,null,null,null,null,null,null,null,null,null,null,null,null,null,null,null,{"$f":"Instructions!C19","v":"March"},{"$f":"Instructions!B19","v":2024}]
[]
[null,null,null,null,null,null,null,null,null,null,null,null,"Total Number of Record",{"$f":"COUNTA('Marks Entry 6-8'!F:F)","v":1}]
[{"$f":"\"Report Card \"&Q3& \" - \"&R3","v":"Report Card March - 2024"}]
[null,null,null,null,null,null,null,null,null,null,null,null,"Sr No. of Record"]
[null,"Student Name        :",null,null,{"$f":"IFERROR(VLOOKUP($N$8,'Marks Entry 6-8'!$A$1:$AY$401,6,0),\"\")","v":0},null,null,null,null,null,null,null,null,1]
[null,"E-Punjab ID              :",null,null,{"$f":"IFERROR(VLOOKUP($N$8,'Marks Entry 6-8'!$A$1:$AY$401,5,0),\"\")","v":0}]
[null,"Father’s Name       :",null,null,{"$f":"IFERROR(VLOOKUP($N$8,'Marks Entry 6-8'!$A$1:$AY$401,7,0),\"\")","v":0}]
[null,"Mother’s Name     :",null,null,{"$f":"IFERROR(VLOOKUP($N$8,'Marks Entry 6-8'!$A$1:$AY$401,8,0),\"\")","v":0}]
[null,"Class & Section      :",null,null,{"$f":"IFERROR(VLOOKUP($N$8,'Marks Entry 6-8'!$A$1:$AY$401,3,0)&\" \"&VLOOKUP($N$8,'Marks Entry 6-8'!$A$1:$AY$401,4,0),\"\")","v":" "}]
[null,{"$f":"\"has secured subject wise marks and grade as mentioned below in School Examination held in \" & Q3 & \"  \"&R3","v":"has secured subject wise marks and grade as mentioned below in School Examination held in March  2024"}]
[]
[null,"Sr. no.","Subject Name",null,null,null,"Total Marks",null,"Marks Obtained","Grade"]
[null,1,"PUNJABI",null,null,null,{"$f":"Instructions!C23","v":100},null,{"$f":"IFERROR(VLOOKUP($N$8,'Marks Entry 6-8'!$A$1:$AY$401,11,0),\"\")","v":0},{"$f":"IFERROR(VLOOKUP($N$8,'Marks Entry 6-8'!$A$1:$AY$401,37,0),\"\")","v":"E"}]
[null,2,"ENGLISH",null,null,null,{"$f":"Instructions!C24","v":100},null,{"$f":"IFERROR(VLOOKUP($N$8,'Marks Entry 6-8'!$A$1:$AY$401,12,0),\"\")","v":0},{"$f":"IFERROR(VLOOKUP($N$8,'Marks Entry 6-8'!$A$1:$AY$401,38,0),\"\")","v":"E"}]
[null,3,"HINDI",null,null,null,{"$f":"Instructions!C25","v":100},null,{"$f":"IFERROR(VLOOKUP($N$8,'Marks Entry 6-8'!$A$1:$AY$401,13,0),\"\")","v":0},{"$f":"IFERROR(VLOOKUP($N$8,'Marks Entry 6-8'!$A$1:$AY$401,39,0),\"\")","v":"E"}]
[null,4,"MATHEMATICS",null,null,null,{"$f":"Instructions!C26","v":100},null,{"$f":"IFERROR(VLOOKUP($N$8,'Marks Entry 6-8'!$A$1:$AY$401,14,0),\"\")","v":0},{"$f":"IFERROR(VLOOKUP($N$8,'Marks Entry 6-8'!$A$1:$AY$401,40,0),\"\")","v":"E"}]
[null,5,"SCIENCE",null,null,null,{"$f":"Instructions!C27","v":100},null,{"$f":"IFERROR(VLOOKUP($N$8,'Marks Entry 6-8'!$A$1:$AY$401,15,0),\"\")","v":0},{"$f":"IFERROR(VLOOKUP($N$8,'Marks Entry 6-8'!$A$1:$AY$401,41,0),\"\")","v":"E"}]
[null,6,"SOCIAL SCIENCE",null,null,null,{"$f":"Instructions!C28","v":100},null,{"$f":"IFERROR(VLOOKUP($N$8,'Marks Entry 6-8'!$A$1:$AY$401,16,0),\"\")","v":0},{"$f":"IFERROR(VLOOKUP($N$8,'Marks Entry 6-8'!$A$1:$AY$401,42,0),\"\")","v":"E"}]
[null,7,"*COMPUTER SCIENCE",null,null,null,{"$f":"Instructions!C29","v":100},null,{"$f":"IFERROR(VLOOKUP($N$8,'Marks Entry 6-8'!$A$1:$AY$401,17,0),\"\")","v":0},{"$f":"IFERROR(VLOOKUP($N$8,'Marks Entry 6-8'!$A$1:$AY$401,43,0),\"\")","v":"E"}]
[null,8,"*HEALTH & PHY. EDU. ",null,null,null,{"$f":"Instructions!C30","v":100},null,{"$f":"IFERROR(VLOOKUP($N$8,'Marks Entry 6-8'!$A$1:$AY$401,20,0),\"\")","v":0},{"$f":"IFERROR(VLOOKUP($N$8,'Marks Entry 6-8'!$A$1:$AY$401,46,0),\"\")","v":"E"}]
[null,9,{"$f":"\"*\"&Instructions!E31","v":"*DRAWING"},null,null,null,{"$f":"Instructions!C31","v":100},null,{"$f":"IFERROR(VLOOKUP($N$8,'Marks Entry 6-8'!$A$1:$AY$401,19,0),\"\")","v":0},{"$f":"IFERROR(VLOOKUP($N$8,'Marks Entry 6-8'!$A$1:$AY$401,45,0),\"\")","v":"E"}]
[]
[null,"RESULT    :",null,{"$f":"IFERROR(VLOOKUP($N$8,'Marks Entry 6-8'!$A$1:$AY$401,36,0),\"\")","v":"----"},null,"Grand Total",null,{"$f":"Instructions!C33","v":600},{"$f":"IFERROR(VLOOKUP($N$8,'Marks Entry 6-8'!$A$1:$AY$401,21,0),\"\")","v":"--"},{"$f":"IFERROR(VLOOKUP($N$8,'Marks Entry 6-8'!$A$1:$AY$401,47,0),\"\")","v":"--"}]
[null,"Note: * Implies marks obtained in subjects are grading subjects and have not been added in Grand Total"]
[]
[null,"Grade Description"]
[null,"A+  Above 90% marks ",null,null,null,"A  Above 80% & upto 90% marks"]
[null,"B+  Above 70% & upto  80% marks",null,null,null,"B  Above 60% & upto 70% marks"]
[null,"C+  Above 50% & upto 60% marks",null,null,null,"C  Above 40% & upto 50% marks"]
[null,"D   33%  & upto 40% marks",null,null,null,"E Below 33% marks"]
[]
[]
[]
[null,"Date   :  ",{"$f":"Instructions!C20","v":"2024-03-31"},null,null,null,null,null,null,"Signature "]
[]
[null,null,null,null,null,null,null,null,"www.Teachershelp.in  "]

{"sheet":"Abstract 6-8","index":3,"n_rows":14,"n_cols":16,"rows_kept":14,"cut":false,"hidden":false,"merged":[[0,0,0,10],[0,13,0,15],[13,1,13,4]]}
["Subject & Grade Wise  Students Counts Details",null,null,null,null,null,null,null,null,null,null,null,null,{"$f":"\"Topper of Class \"&B2","v":"Topper of Class 7th"}]
["Class","7th","Section","A",null,null,null,null,null,null,null,null,null,"Rank","Student Name","Marks"]
["Grade/Subject","Punjabi ","English","Hindi","Maths.","Science","Social Sci.","Computer Sci","Welcome Life","Drawing","Physical Edu.",null,null,1,"ASHISH",549]
["A+",{"$f":"COUNTIFS('Marks Entry 6-8'!$C:$C,$B$2,'Marks Entry 6-8'!$D:$D,$D$2,'Marks Entry 6-8'!AK:AK,$A4)","v":0},{"$f":"COUNTIFS('Marks Entry 6-8'!$C:$C,$B$2,'Marks Entry 6-8'!$D:$D,$D$2,'Marks Entry 6-8'!AL:AL,$A4)","v":0},{"$f":"COUNTIFS('Marks Entry 6-8'!$C:$C,$B$2,'Marks Entry 6-8'!$D:$D,$D$2,'Marks Entry 6-8'!AM:AM,$A4)","v":0},{"$f":"COUNTIFS('Marks Entry 6-8'!$C:$C,$B$2,'Marks Entry 6-8'!$D:$D,$D$2,'Marks Entry 6-8'!AN:AN,$A4)","v":0},{"$f":"COUNTIFS('Marks Entry 6-8'!$C:$C,$B$2,'Marks Entry 6-8'!$D:$D,$D$2,'Marks Entry 6-8'!AO:AO,$A4)","v":0},{"$f":"COUNTIFS('Marks Entry 6-8'!$C:$C,$B$2,'Marks Entry 6-8'!$D:$D,$D$2,'Marks Entry 6-8'!AP:AP,$A4)","v":0},{"$f":"COUNTIFS('Marks Entry 6-8'!$C:$C,$B$2,'Marks Entry 6-8'!$D:$D,$D$2,'Marks Entry 6-8'!AQ:AQ,$A4)","v":0},{"$f":"COUNTIFS('Marks Entry 6-8'!$C:$C,$B$2,'Marks Entry 6-8'!$D:$D,$D$2,'Marks Entry 6-8'!AR:AR,$A4)","v":0},{"$f":"COUNTIFS('Marks Entry 6-8'!$C:$C,$B$2,'Marks Entry 6-8'!$D:$D,$D$2,'Marks Entry 6-8'!AS:AS,$A4)","v":0},{"$f":"COUNTIFS('Marks Entry 6-8'!$C:$C,$B$2,'Marks Entry 6-8'!$D:$D,$D$2,'Marks Entry 6-8'!AT:AT,$A4)","v":0},null,null,2,"JASMEET KAUR",548]
["A",{"$f":"COUNTIFS('Marks Entry 6-8'!$C:$C,$B$2,'Marks Entry 6-8'!$D:$D,$D$2,'Marks Entry 6-8'!AK:AK,$A5)","v":0},{"$f":"COUNTIFS('Marks Entry 6-8'!$C:$C,$B$2,'Marks Entry 6-8'!$D:$D,$D$2,'Marks Entry 6-8'!AL:AL,$A5)","v":0},{"$f":"COUNTIFS('Marks Entry 6-8'!$C:$C,$B$2,'Marks Entry 6-8'!$D:$D,$D$2,'Marks Entry 6-8'!AM:AM,$A5)","v":0},{"$f":"COUNTIFS('Marks Entry 6-8'!$C:$C,$B$2,'Marks Entry 6-8'!$D:$D,$D$2,'Marks Entry 6-8'!AN:AN,$A5)","v":0},{"$f":"COUNTIFS('Marks Entry 6-8'!$C:$C,$B$2,'Marks Entry 6-8'!$D:$D,$D$2,'Marks Entry 6-8'!AO:AO,$A5)","v":0},{"$f":"COUNTIFS('Marks Entry 6-8'!$C:$C,$B$2,'Marks Entry 6-8'!$D:$D,$D$2,'Marks Entry 6-8'!AP:AP,$A5)","v":0},{"$f":"COUNTIFS('Marks Entry 6-8'!$C:$C,$B$2,'Marks Entry 6-8'!$D:$D,$D$2,'Marks Entry 6-8'!AQ:AQ,$A5)","v":0},{"$f":"COUNTIFS('Marks Entry 6-8'!$C:$C,$B$2,'Marks Entry 6-8'!$D:$D,$D$2,'Marks Entry 6-8'!AR:AR,$A5)","v":0},{"$f":"COUNTIFS('Marks Entry 6-8'!$C:$C,$B$2,'Marks Entry 6-8'!$D:$D,$D$2,'Marks Entry 6-8'!AS:AS,$A5)","v":0},{"$f":"COUNTIFS('Marks Entry 6-8'!$C:$C,$B$2,'Marks Entry 6-8'!$D:$D,$D$2,'Marks Entry 6-8'!AT:AT,$A5)","v":0},null,null,3,"KAMAL KUMAR",548]
["B+",{"$f":"COUNTIFS('Marks Entry 6-8'!$C:$C,$B$2,'Marks Entry 6-8'!$D:$D,$D$2,'Marks Entry 6-8'!AK:AK,$A6)","v":0},{"$f":"COUNTIFS('Marks Entry 6-8'!$C:$C,$B$2,'Marks Entry 6-8'!$D:$D,$D$2,'Marks Entry 6-8'!AL:AL,$A6)","v":0},{"$f":"COUNTIFS('Marks Entry 6-8'!$C:$C,$B$2,'Marks Entry 6-8'!$D:$D,$D$2,'Marks Entry 6-8'!AM:AM,$A6)","v":0},{"$f":"COUNTIFS('Marks Entry 6-8'!$C:$C,$B$2,'Marks Entry 6-8'!$D:$D,$D$2,'Marks Entry 6-8'!AN:AN,$A6)","v":0},{"$f":"COUNTIFS('Marks Entry 6-8'!$C:$C,$B$2,'Marks Entry 6-8'!$D:$D,$D$2,'Marks Entry 6-8'!AO:AO,$A6)","v":0},{"$f":"COUNTIFS('Marks Entry 6-8'!$C:$C,$B$2,'Marks Entry 6-8'!$D:$D,$D$2,'Marks Entry 6-8'!AP:AP,$A6)","v":0},{"$f":"COUNTIFS('Marks Entry 6-8'!$C:$C,$B$2,'Marks Entry 6-8'!$D:$D,$D$2,'Marks Entry 6-8'!AQ:AQ,$A6)","v":0},{"$f":"COUNTIFS('Marks Entry 6-8'!$C:$C,$B$2,'Marks Entry 6-8'!$D:$D,$D$2,'Marks Entry 6-8'!AR:AR,$A6)","v":0},{"$f":"COUNTIFS('Marks Entry 6-8'!$C:$C,$B$2,'Marks Entry 6-8'!$D:$D,$D$2,'Marks Entry 6-8'!AS:AS,$A6)","v":0},{"$f":"COUNTIFS('Marks Entry 6-8'!$C:$C,$B$2,'Marks Entry 6-8'!$D:$D,$D$2,'Marks Entry 6-8'!AT:AT,$A6)","v":0},null,null,4,"JASHANPREET SINGH",546]
["B",{"$f":"COUNTIFS('Marks Entry 6-8'!$C:$C,$B$2,'Marks Entry 6-8'!$D:$D,$D$2,'Marks Entry 6-8'!AK:AK,$A7)","v":0},{"$f":"COUNTIFS('Marks Entry 6-8'!$C:$C,$B$2,'Marks Entry 6-8'!$D:$D,$D$2,'Marks Entry 6-8'!AL:AL,$A7)","v":0},{"$f":"COUNTIFS('Marks Entry 6-8'!$C:$C,$B$2,'Marks Entry 6-8'!$D:$D,$D$2,'Marks Entry 6-8'!AM:AM,$A7)","v":0},{"$f":"COUNTIFS('Marks Entry 6-8'!$C:$C,$B$2,'Marks Entry 6-8'!$D:$D,$D$2,'Marks Entry 6-8'!AN:AN,$A7)","v":0},{"$f":"COUNTIFS('Marks Entry 6-8'!$C:$C,$B$2,'Marks Entry 6-8'!$D:$D,$D$2,'Marks Entry 6-8'!AO:AO,$A7)","v":0},{"$f":"COUNTIFS('Marks Entry 6-8'!$C:$C,$B$2,'Marks Entry 6-8'!$D:$D,$D$2,'Marks Entry 6-8'!AP:AP,$A7)","v":0},{"$f":"COUNTIFS('Marks Entry 6-8'!$C:$C,$B$2,'Marks Entry 6-8'!$D:$D,$D$2,'Marks Entry 6-8'!AQ:AQ,$A7)","v":0},{"$f":"COUNTIFS('Marks Entry 6-8'!$C:$C,$B$2,'Marks Entry 6-8'!$D:$D,$D$2,'Marks Entry 6-8'!AR:AR,$A7)","v":0},{"$f":"COUNTIFS('Marks Entry 6-8'!$C:$C,$B$2,'Marks Entry 6-8'!$D:$D,$D$2,'Marks Entry 6-8'!AS:AS,$A7)","v":0},{"$f":"COUNTIFS('Marks Entry 6-8'!$C:$C,$B$2,'Marks Entry 6-8'!$D:$D,$D$2,'Marks Entry 6-8'!AT:AT,$A7)","v":0},null,null,5,"SUJATA KUMARI",544]
["C+",{"$f":"COUNTIFS('Marks Entry 6-8'!$C:$C,$B$2,'Marks Entry 6-8'!$D:$D,$D$2,'Marks Entry 6-8'!AK:AK,$A8)","v":0},{"$f":"COUNTIFS('Marks Entry 6-8'!$C:$C,$B$2,'Marks Entry 6-8'!$D:$D,$D$2,'Marks Entry 6-8'!AL:AL,$A8)","v":0},{"$f":"COUNTIFS('Marks Entry 6-8'!$C:$C,$B$2,'Marks Entry 6-8'!$D:$D,$D$2,'Marks Entry 6-8'!AM:AM,$A8)","v":0},{"$f":"COUNTIFS('Marks Entry 6-8'!$C:$C,$B$2,'Marks Entry 6-8'!$D:$D,$D$2,'Marks Entry 6-8'!AN:AN,$A8)","v":0},{"$f":"COUNTIFS('Marks Entry 6-8'!$C:$C,$B$2,'Marks Entry 6-8'!$D:$D,$D$2,'Marks Entry 6-8'!AO:AO,$A8)","v":0},{"$f":"COUNTIFS('Marks Entry 6-8'!$C:$C,$B$2,'Marks Entry 6-8'!$D:$D,$D$2,'Marks Entry 6-8'!AP:AP,$A8)","v":0},{"$f":"COUNTIFS('Marks Entry 6-8'!$C:$C,$B$2,'Marks Entry 6-8'!$D:$D,$D$2,'Marks Entry 6-8'!AQ:AQ,$A8)","v":0},{"$f":"COUNTIFS('Marks Entry 6-8'!$C:$C,$B$2,'Marks Entry 6-8'!$D:$D,$D$2,'Marks Entry 6-8'!AR:AR,$A8)","v":0},{"$f":"COUNTIFS('Marks Entry 6-8'!$C:$C,$B$2,'Marks Entry 6-8'!$D:$D,$D$2,'Marks Entry 6-8'!AS:AS,$A8)","v":0},{"$f":"COUNTIFS('Marks Entry 6-8'!$C:$C,$B$2,'Marks Entry 6-8'!$D:$D,$D$2,'Marks Entry 6-8'!AT:AT,$A8)","v":0},null,null,6,"ROSHNI",538]
["C",{"$f":"COUNTIFS('Marks Entry 6-8'!$C:$C,$B$2,'Marks Entry 6-8'!$D:$D,$D$2,'Marks Entry 6-8'!AK:AK,$A9)","v":0},{"$f":"COUNTIFS('Marks Entry 6-8'!$C:$C,$B$2,'Marks Entry 6-8'!$D:$D,$D$2,'Marks Entry 6-8'!AL:AL,$A9)","v":0},{"$f":"COUNTIFS('Marks Entry 6-8'!$C:$C,$B$2,'Marks Entry 6-8'!$D:$D,$D$2,'Marks Entry 6-8'!AM:AM,$A9)","v":0},{"$f":"COUNTIFS('Marks Entry 6-8'!$C:$C,$B$2,'Marks Entry 6-8'!$D:$D,$D$2,'Marks Entry 6-8'!AN:AN,$A9)","v":0},{"$f":"COUNTIFS('Marks Entry 6-8'!$C:$C,$B$2,'Marks Entry 6-8'!$D:$D,$D$2,'Marks Entry 6-8'!AO:AO,$A9)","v":0},{"$f":"COUNTIFS('Marks Entry 6-8'!$C:$C,$B$2,'Marks Entry 6-8'!$D:$D,$D$2,'Marks Entry 6-8'!AP:AP,$A9)","v":0},{"$f":"COUNTIFS('Marks Entry 6-8'!$C:$C,$B$2,'Marks Entry 6-8'!$D:$D,$D$2,'Marks Entry 6-8'!AQ:AQ,$A9)","v":0},{"$f":"COUNTIFS('Marks Entry 6-8'!$C:$C,$B$2,'Marks Entry 6-8'!$D:$D,$D$2,'Marks Entry 6-8'!AR:AR,$A9)","v":0},{"$f":"COUNTIFS('Marks Entry 6-8'!$C:$C,$B$2,'Marks Entry 6-8'!$D:$D,$D$2,'Marks Entry 6-8'!AS:AS,$A9)","v":0},{"$f":"COUNTIFS('Marks Entry 6-8'!$C:$C,$B$2,'Marks Entry 6-8'!$D:$D,$D$2,'Marks Entry 6-8'!AT:AT,$A9)","v":0},null,null,7,"GAGANDEEP KAUR",536]
["D",{"$f":"COUNTIFS('Marks Entry 6-8'!$C:$C,$B$2,'Marks Entry 6-8'!$D:$D,$D$2,'Marks Entry 6-8'!AK:AK,$A10)","v":0},{"$f":"COUNTIFS('Marks Entry 6-8'!$C:$C,$B$2,'Marks Entry 6-8'!$D:$D,$D$2,'Marks Entry 6-8'!AL:AL,$A10)","v":0},{"$f":"COUNTIFS('Marks Entry 6-8'!$C:$C,$B$2,'Marks Entry 6-8'!$D:$D,$D$2,'Marks Entry 6-8'!AM:AM,$A10)","v":0},{"$f":"COUNTIFS('Marks Entry 6-8'!$C:$C,$B$2,'Marks Entry 6-8'!$D:$D,$D$2,'Marks Entry 6-8'!AN:AN,$A10)","v":0},{"$f":"COUNTIFS('Marks Entry 6-8'!$C:$C,$B$2,'Marks Entry 6-8'!$D:$D,$D$2,'Marks Entry 6-8'!AO:AO,$A10)","v":0},{"$f":"COUNTIFS('Marks Entry 6-8'!$C:$C,$B$2,'Marks Entry 6-8'!$D:$D,$D$2,'Marks Entry 6-8'!AP:AP,$A10)","v":0},{"$f":"COUNTIFS('Marks Entry 6-8'!$C:$C,$B$2,'Marks Entry 6-8'!$D:$D,$D$2,'Marks Entry 6-8'!AQ:AQ,$A10)","v":0},{"$f":"COUNTIFS('Marks Entry 6-8'!$C:$C,$B$2,'Marks Entry 6-8'!$D:$D,$D$2,'Marks Entry 6-8'!AR:AR,$A10)","v":0},{"$f":"COUNTIFS('Marks Entry 6-8'!$C:$C,$B$2,'Marks Entry 6-8'!$D:$D,$D$2,'Marks Entry 6-8'!AS:AS,$A10)","v":0},{"$f":"COUNTIFS('Marks Entry 6-8'!$C:$C,$B$2,'Marks Entry 6-8'!$D:$D,$D$2,'Marks Entry 6-8'!AT:AT,$A10)","v":0},null,null,8,"GURKANWAL SINGH",535]
["E",{"$f":"COUNTIFS('Marks Entry 6-8'!$C:$C,$B$2,'Marks Entry 6-8'!$D:$D,$D$2,'Marks Entry 6-8'!AK:AK,$A11)","v":0},{"$f":"COUNTIFS('Marks Entry 6-8'!$C:$C,$B$2,'Marks Entry 6-8'!$D:$D,$D$2,'Marks Entry 6-8'!AL:AL,$A11)","v":0},{"$f":"COUNTIFS('Marks Entry 6-8'!$C:$C,$B$2,'Marks Entry 6-8'!$D:$D,$D$2,'Marks Entry 6-8'!AM:AM,$A11)","v":0},{"$f":"COUNTIFS('Marks Entry 6-8'!$C:$C,$B$2,'Marks Entry 6-8'!$D:$D,$D$2,'Marks Entry 6-8'!AN:AN,$A11)","v":0},{"$f":"COUNTIFS('Marks Entry 6-8'!$C:$C,$B$2,'Marks Entry 6-8'!$D:$D,$D$2,'Marks Entry 6-8'!AO:AO,$A11)","v":0},{"$f":"COUNTIFS('Marks Entry 6-8'!$C:$C,$B$2,'Marks Entry 6-8'!$D:$D,$D$2,'Marks Entry 6-8'!AP:AP,$A11)","v":0},{"$f":"COUNTIFS('Marks Entry 6-8'!$C:$C,$B$2,'Marks Entry 6-8'!$D:$D,$D$2,'Marks Entry 6-8'!AQ:AQ,$A11)","v":0},{"$f":"COUNTIFS('Marks Entry 6-8'!$C:$C,$B$2,'Marks Entry 6-8'!$D:$D,$D$2,'Marks Entry 6-8'!AR:AR,$A11)","v":0},{"$f":"COUNTIFS('Marks Entry 6-8'!$C:$C,$B$2,'Marks Entry 6-8'!$D:$D,$D$2,'Marks Entry 6-8'!AS:AS,$A11)","v":0},{"$f":"COUNTIFS('Marks Entry 6-8'!$C:$C,$B$2,'Marks Entry 6-8'!$D:$D,$D$2,'Marks Entry 6-8'!AT:AT,$A11)","v":0},null,null,9,"GOLU SINGH",535]
["Total Student",{"$f":"SUM(B4:B11)","v":0},{"$f":"SUM(C4:C11)","v":0},0,0,0,0,0,0,0,0,null,null,10,"DALJEET SINGH",532]
[]
[null,"Total Fail/Reappear Students ",null,null,null,{"$f":"COUNTIFS('Marks Entry 6-8'!C2:C500,B2,'Marks Entry 6-8'!V2:V500,0)","v":0}]